{"text_format":"1","workbook":"xlsx","n_sheets":14,"sheets":["TOP画面","管理者設定画面１","管理者設定画面２","プラン選択画面","人数入力画面","加入者・保険会社情報入力画面","加入依頼書","告知書","見積書","見積書(印刷用背景色なし)","項目","WK","保険料計算用","ヒント"],"not_rendered":{"charts":0,"images":6,"macros":1,"external_links":0,"defined_names":63,"comments":1,"pivot_tables":0},"unopened":[],"bounds":{"document_bytes":16777216,"sheet_cells":100000,"rows_first":2000,"rows_last":500,"rows_between":2000,"halvings":0,"cell_chars":16384,"cell_head_chars":4096},"cells_cut":0,"cells_raw":0,"read":"whole","date_system":"1900"}

{"sheet":"TOP画面","index":0,"n_rows":6,"n_cols":12,"rows_kept":6,"cut":false,"hidden":false,"merged":[[5,5,9,29],[2,5,2,10]]}
[]
[]
[null,null,null,null,null,{"$f":"IF(管理者設定画面１!I4=\"\",\"\",管理者設定画面１!I4)","v":2025},null,null,null,null,null,"　年度"]
[]
[]
[null,null,null,null,null,{"$f":"\"【日本保育協会】保険料計算・\"&CHAR(10)&\n\"加入依頼書作成ツール（\"&管理者設定画面１!AN2&\"）\"","v":"【日本保育協会】保険料計算・\n加入依頼書作成ツール（Ver2.06）"}]

{"sheet":"管理者設定画面１","index":1,"n_rows":57,"n_cols":77,"rows_kept":57,"cut":false,"hidden":true,"merged":[[55,42,55,53],[55,54,55,57],[55,58,55,61],[55,62,55,65],[55,66,55,69],[55,70,55,73],[55,74,55,77],[56,42,56,53],[56,54,56,57],[56,58,56,61],[56,62,56,65],[56,66,56,69],[56,70,56,73],[56,74,56,77],[53,62,53,65],[53,66,53,69],[53,70,53,73],[53,74,53,77],[54,42,54,53],[54,54,54,57],[54,58,54,61],[54,62,54,65],[54,66,54,69],[54,70,54,73],[54,74,54,77],[47,42,48,50],[47,51,48,53],[47,54,48,56],[47,57,48,59],[49,42,50,50],[49,51,50,53],[49,54,50,56],[49,57,50,59],[53,54,53,57],[53,58,53,61],[40,42,41,50],[40,51,41,53],[40,54,41,56],[40,57,41,59],[44,51,44,53],[44,54,44,56],[44,57,44,59],[45,42,46,50],[45,51,46,53],[45,54,46,56],[45,57,46,59],[34,63,34,69],[34,70,34,72],[34,73,34,75],[34,76,34,78],[35,63,35,69],[35,70,35,72],[35,73,35,75],[35,76,35,78],[26,62,37,62],[26,63,26,69],[26,70,26,72],[26,73,26,75],[26,76,26,78],[36,63,36,69],[36,70,36,72],[36,73,36,75],[36,76,36,78],[37,63,37,69],[37,70,37,72],[37,73,37,75],[37,76,37,78],[31,63,31,69],[31,70,31,72],[31,73,31,75],[31,76,31,78],[32,63,32,69],[32,70,32,72],[32,73,32,75],[32,76,32,78],[33,63,33,69],[33,70,33,72],[33,73,33,75],[33,76,33,78],[25,42,25,51],[25,52,25,55],[25,56,25,59],[25,70,25,72],[25,73,25,75],[25,76,25,78],[26,42,26,51],[26,52,26,55],[27,63,27,69],[27,70,27,72],[27,73,27,75],[27,76,27,78],[27,42,27,51],[27,52,27,55],[27,56,27,59],[30,63,30,69],[30,70,30,72],[30,73,30,75],[23,62,23,69],[23,70,23,72],[23,73,23,75],[23,76,23,78],[24,52,24,55],[24,56,24,59],[24,62,25,69],[24,70,24,78],[28,63,28,69],[28,70,28,72],[28,73,28,75],[28,76,28,78],[29,63,29,69],[29,70,29,72],[29,73,29,75],[29,76,29,78],[30,76,30,78],[19,62,19,65],[19,66,19,69],[19,70,19,73],[19,74,19,77],[20,42,20,43],[20,44,20,47],[20,48,20,49],[20,50,20,53],[20,62,20,65],[20,66,20,69],[20,70,20,73],[20,74,20,77],[14,70,14,73],[17,42,17,59],[17,62,17,65],[17,66,17,69],[17,70,17,73],[17,74,17,77],[18,62,18,65],[18,66,18,69],[18,70,18,73],[18,74,18,77],[14,42,14,43],[14,44,14,47],[14,48,14,49],[14,50,14,53],[14,54,14,55],[14,56,14,59],[14,62,14,63],[14,64,14,67],[14,68,14,69],[12,70,12,73],[13,42,13,43],[13,44,13,47],[13,48,13,49],[13,50,13,53],[13,54,13,55],[13,56,13,59],[13,62,13,63],[13,64,13,67],[13,68,13,69],[13,70,13,73],[12,42,12,43],[12,44,12,47],[12,48,12,49],[12,50,12,53],[12,54,12,55],[12,56,12,59],[12,62,12,63],[12,64,12,67],[12,68,12,69],[10,70,10,73],[11,42,11,43],[11,44,11,47],[11,48,11,49],[11,50,11,53],[11,54,11,55],[11,56,11,59],[11,62,11,63],[11,64,11,67],[11,68,11,69],[11,70,11,73],[10,42,10,43],[10,44,10,47],[10,48,10,49],[10,50,10,53],[10,54,10,55],[10,56,10,59],[10,62,10,63],[10,64,10,67],[10,68,10,69],[8,70,8,73],[9,42,9,43],[9,44,9,47],[9,48,9,49],[9,50,9,53],[9,54,9,55],[9,56,9,59],[9,62,9,63],[9,64,9,67],[9,68,9,69],[9,70,9,73],[8,42,8,43],[8,44,8,47],[8,48,8,49],[8,50,8,53],[8,54,8,55],[8,56,8,59],[8,62,8,63],[8,64,8,67],[8,68,8,69],[6,56,6,59],[6,62,6,63],[6,64,6,67],[6,68,6,69],[6,70,6,73],[7,42,7,43],[7,44,7,47],[7,48,7,49],[7,50,7,53],[7,54,7,55],[7,56,7,59],[7,62,7,63],[7,64,7,67],[7,68,7,69],[7,70,7,73],[33,51,33,53],[33,54,33,56],[36,42,37,50],[36,51,37,53],[36,54,37,56],[38,42,39,50],[38,51,39,53],[38,54,39,56],[26,56,26,59],[33,57,33,59],[36,57,37,59],[30,42,30,59],[34,42,35,50],[34,51,35,53],[34,54,35,56],[34,57,35,59],[38,57,39,59],[3,42,3,47],[3,48,3,50],[6,42,6,43],[6,44,6,47],[6,48,6,49],[6,50,6,53],[6,54,6,55],[21,42,21,43],[21,44,21,47],[21,48,21,49],[21,50,21,53],[45,11,46,13],[45,14,46,16],[45,17,46,19],[47,2,48,10],[49,2,50,10],[47,11,48,13],[47,14,48,16],[47,17,48,19],[49,11,50,13],[49,14,50,16],[49,17,50,19],[45,2,46,10],[11,16,11,19],[6,4,6,7],[7,4,7,7],[8,4,8,7],[9,4,9,7],[10,4,10,7],[11,4,11,7],[12,4,12,7],[3,2,3,7],[11,8,11,9],[3,8,3,10],[9,8,9,9],[9,10,9,13],[10,8,10,9],[10,10,10,13],[9,2,9,3],[10,2,10,3],[9,14,9,15],[9,16,9,19],[10,14,10,15],[10,16,10,19],[1,10,1,14],[1,15,1,19],[6,2,6,3],[7,2,7,3],[6,8,6,9],[6,10,6,13],[7,8,7,9],[7,10,7,13],[8,8,8,9],[8,10,8,13],[8,2,8,3],[6,14,6,15],[6,16,6,19],[7,14,7,15],[7,16,7,19],[8,14,8,15],[8,16,8,19],[8,24,8,27],[8,28,8,29],[8,30,8,33],[9,22,9,23],[9,24,9,27],[9,28,9,29],[9,30,9,33],[6,28,6,29],[6,30,6,33],[7,22,7,23],[7,24,7,27],[7,28,7,29],[7,30,7,33],[6,22,6,23],[8,22,8,23],[6,24,6,27],[13,2,13,3],[14,2,14,3],[13,4,13,7],[14,4,14,7],[14,24,14,27],[10,28,10,29],[10,30,10,33],[11,22,11,23],[11,24,11,27],[11,28,11,29],[11,30,11,33],[13,14,13,15],[13,16,13,19],[10,22,10,23],[12,22,12,23],[11,14,11,15],[10,24,10,27],[11,10,11,13],[12,8,12,9],[12,10,12,13],[13,8,13,9],[13,10,13,13],[11,2,11,3],[12,2,12,3],[12,24,12,27],[12,28,12,29],[12,30,12,33],[13,22,13,23],[13,24,13,27],[13,28,13,29],[13,30,13,33],[14,14,14,15],[14,16,14,19],[14,22,14,23],[12,14,12,15],[12,16,12,19],[14,28,14,29],[14,30,14,33],[17,2,17,19],[17,26,17,29],[14,8,14,9],[14,10,14,13],[20,34,20,37],[20,38,20,41],[23,30,23,32],[23,33,23,35],[23,36,23,38],[20,2,20,3],[20,4,20,7],[20,8,20,9],[20,10,20,13],[21,2,21,3],[21,4,21,7],[21,8,21,9],[21,10,21,13],[25,12,25,15],[25,2,25,11],[26,2,26,11],[27,12,27,15],[29,33,29,35],[36,23,36,29],[34,36,34,38],[25,30,25,32],[25,33,25,35],[25,36,25,38],[26,16,26,19],[33,11,33,13],[33,14,33,16],[33,17,33,19],[34,11,35,13],[34,14,35,16],[34,17,35,19],[33,33,33,35],[33,36,33,38],[26,12,26,15],[36,2,37,10],[36,11,37,13],[35,30,35,32],[35,33,35,35],[44,17,44,19],[40,2,41,10],[40,11,41,13],[40,14,41,16],[40,17,41,19],[17,38,17,41],[18,38,18,41],[34,2,35,10],[38,2,39,10],[36,17,37,19],[38,14,39,16],[38,17,39,19],[38,11,39,13],[36,14,37,16],[19,26,19,29],[19,30,19,33],[37,23,37,29],[26,22,37,22],[29,36,29,38],[30,30,30,32],[30,33,30,35],[30,36,30,38],[35,36,35,38],[36,30,36,32],[34,30,34,32],[34,33,34,35],[37,36,37,38],[19,34,19,37],[19,38,19,41],[18,26,18,29],[17,30,17,33],[18,30,18,33],[17,34,17,37],[18,34,18,37],[36,33,36,35],[32,36,32,38],[33,30,33,32],[36,36,36,38],[32,33,32,35],[24,30,24,38],[20,26,20,29],[20,30,20,33],[26,30,26,32],[26,33,26,35],[56,30,56,33],[56,34,56,37],[53,14,53,17],[54,14,54,17],[55,14,55,17],[53,34,53,37],[54,34,54,37],[53,30,53,33],[54,30,54,33],[53,26,53,29],[54,26,54,29],[53,22,53,25],[54,22,54,25],[56,18,56,21],[54,18,54,21],[55,18,55,21],[53,18,53,21],[55,22,55,25],[55,26,55,29],[56,2,56,13],[23,22,23,29],[24,22,25,29],[26,23,26,29],[27,23,27,29],[28,23,28,29],[29,23,29,29],[30,23,30,29],[31,23,31,29],[32,23,32,29],[33,23,33,29],[34,23,34,29],[35,23,35,29],[56,14,56,17],[56,22,56,25],[56,26,56,29],[24,12,24,15],[24,16,24,19],[30,2,30,19],[44,11,44,13],[44,14,44,16],[27,2,27,11],[27,16,27,19],[25,16,25,19],[17,22,17,25],[18,22,18,25],[1,34,1,38],[1,39,1,43],[1,22,1,26],[1,27,1,31],[54,2,54,13],[55,2,55,13],[55,30,55,33],[37,30,37,32],[37,33,37,35],[29,30,29,32],[26,36,26,38],[27,30,27,32],[27,33,27,35],[27,36,27,38],[28,30,28,32],[28,33,28,35],[28,36,28,38],[55,34,55,37],[31,30,31,32],[31,33,31,35],[31,36,31,38],[32,30,32,32]]}
[]
[null,"管理者設定画面１",null,null,null,null,null,null,null,null,"管理者パスワード",null,null,null,null,"nippo",null,null,null,null,null,null,"ツール使用期限",null,null,null,null,"2026-03-31",null,null,null,null,null,null,"ツールバージョン",null,null,null,null,"Ver2.06"]
[]
[null,null,"保険料テーブル①",null,null,null,null,null,2025,null,null,"年度",null,null,null,null,null,null,null,null,null,null,null,null,null,null,null,null,null,null,null,null,null,null,null,null,null,null,null,null,null,null,"保険料テーブル②",null,null,null,null,null,null,null,null,"年度",null,null,"※単年対応とするため保険料テーブル②は廃止とする"]
[]
[null,null,"プラン１　保育園児等傷害保険",null,null,null,null,null,null,null,null,null,null,null,null,null,null,null,null,null,null,null,"プラン２　主催行事参加者傷害保険",null,null,null,null,null,null,null,null,null,null,null,null,null,null,null,null,null,null,null,"プラン１　保育園児等傷害保険",null,null,null,null,null,null,null,null,null,null,null,null,null,null,null,null,null,null,null,"プラン２　主催行事参加者傷害保険"]
[null,null,"A1",null,7370,null,null,null,"B1",null,6277,null,null,null,"C1",null,7267,null,null,null,null,null,"A1",null,83,null,null,null,"B1",null,75,null,null,null,null,null,null,null,null,null,null,null,"A1",null,7370,null,null,null,"B1",null,6277,null,null,null,"C1",null,7267,null,null,null,null,null,"A1",null,83,null,null,null,"B1",null,75]
[null,null,"A2",null,4620,null,null,null,"B2",null,3923,null,null,null,"C2",null,4556,null,null,null,null,null,"A2",null,52,null,null,null,"B2",null,48,null,null,null,null,null,null,null,null,null,null,null,"A2",null,4620,null,null,null,"B2",null,3923,null,null,null,"C2",null,4556,null,null,null,null,null,"A2",null,52,null,null,null,"B2",null,48]
[null,null,"A3",null,3700,null,null,null,"B3",null,3142,null,null,null,"C3",null,3648,null,null,null,null,null,"A3",null,41,null,null,null,"B3",null,38,null,null,null,null,null,null,null,null,null,null,null,"A3",null,3700,null,null,null,"B3",null,3142,null,null,null,"C3",null,3648,null,null,null,null,null,"A3",null,41,null,null,null,"B3",null,38]
[null,null,"A4",null,2780,null,null,null,"B4",null,2364,null,null,null,"C4",null,2741,null,null,null,null,null,"A4",null,31,null,null,null,"B4",null,28,null,null,null,null,null,null,null,null,null,null,null,"A4",null,2780,null,null,null,"B4",null,2364,null,null,null,"C4",null,2741,null,null,null,null,null,"A4",null,31,null,null,null,"B4",null,28]
[null,null,"A5",null,2320,null,null,null,"B5",null,1967,null,null,null,"C5",null,2288,null,null,null,null,null,"A5",null,27,null,null,null,"B5",null,23,null,null,null,null,null,null,null,null,null,null,null,"A5",null,2320,null,null,null,"B5",null,1967,null,null,null,"C5",null,2288,null,null,null,null,null,"A5",null,27,null,null,null,"B5",null,23]
[null,null,"A6",null,1860,null,null,null,"B6",null,1571,null,null,null,"C6",null,1834,null,null,null,null,null,"A6",null,21,null,null,null,"B6",null,20,null,null,null,null,null,null,null,null,null,null,null,"A6",null,1860,null,null,null,"B6",null,1571,null,null,null,"C6",null,1834,null,null,null,null,null,"A6",null,21,null,null,null,"B6",null,20]
[null,null,"A7",null,1400,null,null,null,"B7",null,1164,null,null,null,"C7",null,1382,null,null,null,null,null,"A7",null,16,null,null,null,"B7",null,15,null,null,null,null,null,null,null,null,null,null,null,"A7",null,1400,null,null,null,"B7",null,1164,null,null,null,"C7",null,1382,null,null,null,null,null,"A7",null,16,null,null,null,"B7",null,15]
[null,null,"A8",null,1130,null,null,null,"B8",null,946,null,null,null,"C8",null,1116,null,null,null,null,null,"A8",null,13,null,null,null,"B8",null,12,null,null,null,null,null,null,null,null,null,null,null,"A8",null,1130,null,null,null,"B8",null,946,null,null,null,"C8",null,1116,null,null,null,null,null,"A8",null,13,null,null,null,"B8",null,12]
[null,null,"A9",null,960,null,null,null,"B9",null,801,null,null,null,"C9",null,946,null,null,null,null,null,"A9",null,11,null,null,null,"B9",null,9,null,null,null,null,null,null,null,null,null,null,null,"A9",null,960,null,null,null,"B9",null,801,null,null,null,"C9",null,946,null,null,null,null,null,"A9",null,11,null,null,null,"B9",null,9]
[]
[null,null,"プラン３　自動車搭乗中傷害保険",null,null,null,null,null,null,null,null,null,null,null,null,null,null,null,null,null,null,null,"プラン５　保育園賠償責任保険",null,null,null,null,null,null,null,null,null,null,null,null,null,null,null,null,null,null,null,"プラン３　自動車搭乗中傷害保険",null,null,null,null,null,null,null,null,null,null,null,null,null,null,null,null,null,null,null,"プラン５　保育園賠償責任保険"]
[null,null,1800,null,null,null,null,null,null,null,null,null,null,null,null,null,null,null,null,null,null,null,"ER+",null,null,null,"ER",null,null,null,"E",null,null,null,"GR",null,null,null,"G",null,null,null,1800,null,null,null,null,null,null,null,null,null,null,null,null,null,null,null,null,null,null,null,"ER",null,null,null,"E",null,null,null,"GR",null,null,null,"G"]
[null,null,null,null,null,null,null,null,null,null,null,null,null,null,null,null,null,null,null,null,null,null,450,null,null,null,390,null,null,null,340,null,null,null,370,null,null,null,320,null,null,null,null,null,null,null,null,null,null,null,null,null,null,null,null,null,null,null,null,null,null,null,330,null,null,null,280,null,null,null,320,null,null,null,270]
[null,null,"プラン４　保育園職員労災上乗せ保険",null,null,null,null,null,null,null,null,null,null,null,null,null,null,null,null,null,null,null,null,null,null,null,"FR",null,null,null,"F",null,null,null,"HR",null,null,null,"H",null,null,null,"プラン４　保育園職員労災上乗せ保険",null,null,null,null,null,null,null,null,null,null,null,null,null,null,null,null,null,null,null,"FR",null,null,null,"F",null,null,null,"HR",null,null,null,"H"]
[null,null,"A",null,700,null,null,null,"C",null,1550,null,null,null,null,null,null,null,null,null,null,null,null,null,null,null,350,null,null,null,290,null,null,null,310,null,null,null,260,null,null,null,"A",null,700,null,null,null,"C",null,1550,null,null,null,null,null,null,null,null,null,null,null,290,null,null,null,240,null,null,null,270,null,null,null,220]
[null,null,"B",null,1720,null,null,null,"D",null,2500,null,null,null,null,null,null,null,null,null,null,null,null,null,null,null,null,null,null,null,null,null,null,null,null,null,null,null,null,null,null,null,"B",null,1720,null,null,null,"D",null,2500]
[null,null,null,null,null,null,null,null,null,null,null,null,null,null,null,null,null,null,null,null,null,null,"オプション　クレーム対応費用保険",null,null,null,null,null,null,null,null,null,null,null,null,null,null,null,null,null,null,null,null,null,null,null,null,null,null,null,null,null,null,null,null,null,null,null,null,null,null,null,"オプション　クレーム対応費用保険"]
[null,null,"プラン６　個人情報漏えい対応保険",null,null,null,null,null,null,null,null,null,null,null,null,null,null,null,null,null,null,null,"ご加入の型",null,null,null,null,null,null,null,"Q",null,null,"R",null,null,"S",null,null,null,null,null,"プラン６　個人情報漏えい対応保険",null,null,null,null,null,null,null,null,null,null,null,null,null,null,null,null,null,null,null,"ご加入の型",null,null,null,null,null,null,null,"Q",null,null,"R",null,null,"S"]
[null,null,null,null,null,null,null,null,null,null,null,null,"I",null,null,null,"J",null,null,null,null,null,"保険金額",null,null,null,null,null,null,null,"1事故・1期間中",null,null,null,null,null,null,null,null,null,null,null,null,null,null,null,null,null,null,null,null,null,"I",null,null,null,"J",null,null,null,null,null,"保険金額",null,null,null,null,null,null,null,"1事故・1期間中"]
[null,null,"園児数100人以下の場合",null,null,null,null,null,null,null,null,null,20000,null,null,null,32000,null,null,null,null,null,null,null,null,null,null,null,null,null,"50万円",null,null,"150万円",null,null,"300万円",null,null,null,null,null,"園児数100人以下の場合",null,null,null,null,null,null,null,null,null,20000,null,null,null,32000,null,null,null,null,null,null,null,null,null,null,null,null,null,"50万円",null,null,"150万円",null,null,"300万円"]
[null,null,"園児数101人以上200人以下の場合",null,null,null,null,null,null,null,null,null,25000,null,null,null,45000,null,null,null,null,null,"年間保険料","園児数50人以下",null,null,null,null,null,null,19250,null,null,42000,null,null,63000,null,null,null,null,null,"園児数101人以上200人以下の場合",null,null,null,null,null,null,null,null,null,25000,null,null,null,45000,null,null,null,null,null,"年間保険料","園児数50人以下",null,null,null,null,null,null,19250,null,null,42000,null,null,63000]
[null,null,"園児数201人以上の場合",null,null,null,null,null,null,null,null,null,30000,null,null,null,54000,null,null,null,null,null,null,"園児数51人以上100人以下",null,null,null,null,null,null,35000,null,null,75600,null,null,113400,null,null,null,null,null,"園児数201人以上の場合",null,null,null,null,null,null,null,null,null,30000,null,null,null,54000,null,null,null,null,null,null,"園児数51人以上100人以下",null,null,null,null,null,null,35000,null,null,75600,null,null,113400]
[null,null,null,null,null,null,null,null,null,null,null,null,null,null,null,null,null,null,null,null,null,null,null,"園児数101人以上150人以下",null,null,null,null,null,null,49880,null,null,113400,null,null,160650,null,null,null,null,null,null,null,null,null,null,null,null,null,null,null,null,null,null,null,null,null,null,null,null,null,null,"園児数101人以上150人以下",null,null,null,null,null,null,49880,null,null,113400,null,null,160650]
[null,null,"プラン７　保育業務従事者向け賠償責任保険",null,null,null,null,null,null,null,null,null,null,null,null,null,null,null,null,null,null,null,null,"園児数151人以上200人以下",null,null,null,null,null,null,66500,null,null,142800,null,null,201600,null,null,null,null,null,"プラン７　保育業務従事者向け賠償責任保険",null,null,null,null,null,null,null,null,null,null,null,null,null,null,null,null,null,null,null,null,"園児数151人以上200人以下",null,null,null,null,null,null,66500,null,null,142800,null,null,201600]
[null,null,1500,null,null,null,null,null,null,null,null,null,null,null,null,null,null,null,null,null,null,null,null,"園児数201人以上250人以下",null,null,null,null,null,null,78750,null,null,168000,null,null,236250,null,null,null,null,null,1500,null,null,null,null,null,null,null,null,null,null,null,null,null,null,null,null,null,null,null,null,"園児数201人以上250人以下",null,null,null,null,null,null,78750,null,null,168000,null,null,236250]
[null,null,null,null,null,null,null,null,null,null,null,null,null,null,null,null,null,null,null,null,null,null,null,"園児数251人以上300人以下",null,null,null,null,null,null,89250,null,null,189000,null,null,264600,null,null,null,null,null,null,null,null,null,null,null,null,null,null,null,null,null,null,null,null,null,null,null,null,null,null,"園児数251人以上300人以下",null,null,null,null,null,null,89250,null,null,189000,null,null,264600]
[null,null,"プラン８　雇用関連賠償責任保険",null,null,null,null,null,null,null,null,null,null,null,null,null,null,null,null,null,null,null,null,"園児数301人以上350人以下",null,null,null,null,null,null,94500,null,null,199500,null,null,276500,null,null,null,null,null,"プラン８　雇用関連賠償責任保険",null,null,null,null,null,null,null,null,null,null,null,null,null,null,null,null,null,null,null,null,"園児数301人以上350人以下",null,null,null,null,null,null,94500,null,null,199500,null,null,276500]
[null,null,null,null,null,null,null,null,null,null,null,"T",null,null,"U",null,null,null,null,null,null,null,null,"園児数351人以上400人以下",null,null,null,null,null,null,108000,null,null,228000,null,null,316000,null,null,null,null,null,null,null,null,null,null,null,null,null,null,"T",null,null,"U",null,null,null,null,null,null,null,null,"園児数351人以上400人以下",null,null,null,null,null,null,108000,null,null,228000,null,null,316000]
[null,null,"総収入金額\n3億円以下の場合",null,null,null,null,null,null,null,null,17040,null,null,24000,null,null,null,null,null,null,null,null,"園児数401人以上450人以下",null,null,null,null,null,null,121500,null,null,256500,null,null,355500,null,null,null,null,null,"総収入金額\n3億円以下の場合",null,null,null,null,null,null,null,null,17040,null,null,24000,null,null,null,null,null,null,null,null,"園児数401人以上450人以下",null,null,null,null,null,null,121500,null,null,256500,null,null,355500]
[null,null,null,null,null,null,null,null,null,null,null,null,null,null,null,null,null,null,null,null,null,null,null,"園児数451人以上500人以下",null,null,null,null,null,null,135000,null,null,285000,null,null,395000,null,null,null,null,null,null,null,null,null,null,null,null,null,null,null,null,null,null,null,null,null,null,null,null,null,null,"園児数451人以上500人以下",null,null,null,null,null,null,135000,null,null,285000,null,null,395000]
[null,null,"総収入金額\n3億円超10億円以下の場合",null,null,null,null,null,null,null,null,52440,null,null,73920,null,null,null,null,null,null,null,null,"園児数501人以上550人以下",null,null,null,null,null,null,148500,null,null,313500,null,null,434500,null,null,null,null,null,"総収入金額\n3億円超10億円以下の場合",null,null,null,null,null,null,null,null,52440,null,null,73920,null,null,null,null,null,null,null,null,"園児数501人以上550人以下",null,null,null,null,null,null,148500,null,null,313500,null,null,434500]
[null,null,null,null,null,null,null,null,null,null,null,null,null,null,null,null,null,null,null,null,null,null,null,"園児数551人以上",null,null,null,null,null,null,162000,null,null,342000,null,null,474000,null,null,null,null,null,null,null,null,null,null,null,null,null,null,null,null,null,null,null,null,null,null,null,null,null,null,"園児数551人以上",null,null,null,null,null,null,162000,null,null,342000,null,null,474000]
[null,null,"総収入金額\n10億円超30億円以下の場合",null,null,null,null,null,null,null,null,126060,null,null,177780,null,null,null,null,null,null,null,null,null,null,null,null,null,null,null,null,null,null,null,null,null,null,null,null,null,null,null,"総収入金額\n10億円超30億円以下の場合",null,null,null,null,null,null,null,null,126060,null,null,177780]
[]
[null,null,"総収入金額\n30億円超50億円以下の場合",null,null,null,null,null,null,null,null,179950,null,null,253880,null,null,null,null,null,null,null,null,null,null,null,null,null,null,null,null,null,null,null,null,null,null,null,null,null,null,null,"総収入金額\n30億円超50億円以下の場合",null,null,null,null,null,null,null,null,179950,null,null,253880]
[]
[]
[null,null,"プラン９　社会福祉法人向け役員賠償責任保険",null,null,null,null,null,null,null,null,null,null,null,null,null,null,null,null,null,null,null,null,null,null,null,null,null,null,null,null,null,null,null,null,null,null,null,null,null,null,null,"プラン９　社会福祉法人向け役員賠償責任保険"]
[null,null,null,null,null,null,null,null,null,null,null,"N",null,null,"O",null,null,"P",null,null,null,null,null,null,null,null,null,null,null,null,null,null,null,null,null,null,null,null,null,null,null,null,null,null,null,null,null,null,null,null,null,"N",null,null,"O",null,null,"P"]
[null,null,"総収入金額\n3億円以下の場合",null,null,null,null,null,null,null,null,52000,null,null,73000,null,null,105000,null,null,null,null,null,null,null,null,null,null,null,null,null,null,null,null,null,null,null,null,null,null,null,null,"総収入金額\n3億円以下の場合",null,null,null,null,null,null,null,null,52000,null,null,73000,null,null,105000]
[]
[null,null,"総収入金額\n3億円超10億円以下の場合",null,null,null,null,null,null,null,null,56000,null,null,76000,null,null,111000,null,null,null,null,null,null,null,null,null,null,null,null,null,null,null,null,null,null,null,null,null,null,null,null,"総収入金額\n3億円超10億円以下の場合",null,null,null,null,null,null,null,null,56000,null,null,76000,null,null,111000]
[]
[null,null,"総収入金額\n10億円超50億円以下の場合",null,null,null,null,null,null,null,null,66000,null,null,92000,null,null,133000,null,null,null,null,null,null,null,null,null,null,null,null,null,null,null,null,null,null,null,null,null,null,null,null,"総収入金額\n10億円超50億円以下の場合",null,null,null,null,null,null,null,null,66000,null,null,92000,null,null,133000]
[]
[]
[null,null,"プラン１０　保育園動産（什器・備品）補償保険",null,null,null,null,null,null,null,null,null,null,null,null,null,null,null,null,null,null,null,null,null,null,null,null,null,null,null,null,null,null,null,null,null,null,null,null,null,null,null,"プラン１０　保育園動産（什器・備品）補償保険"]
[null,null,null,null,null,null,null,null,null,null,null,null,null,null,"M",null,null,null,"K",null,null,null,"L",null,null,null,"ME",null,null,null,"KE",null,null,null,"LE",null,null,null,null,null,null,null,null,null,null,null,null,null,null,null,null,null,null,null,"M",null,null,null,"K",null,null,null,"L",null,null,null,"ME",null,null,null,"KE",null,null,null,"LE"]
[null,null,"園児数50人以下の場合",null,null,null,null,null,null,null,null,null,null,null,9900,null,null,null,16000,null,null,null,21200,null,null,null,38100,null,null,null,63800,null,null,null,113600,null,null,null,null,null,null,null,"園児数50人以下の場合",null,null,null,null,null,null,null,null,null,null,null,9900,null,null,null,16000,null,null,null,21200,null,null,null,38100,null,null,null,63800,null,null,null,113600]
[null,null,"園児数51人以上100人以下の場合",null,null,null,null,null,null,null,null,null,null,null,9900,null,null,null,22300,null,null,null,29800,null,null,null,44600,null,null,null,82100,null,null,null,142700,null,null,null,null,null,null,null,"園児数51人以上100人以下の場合",null,null,null,null,null,null,null,null,null,null,null,9900,null,null,null,22300,null,null,null,29800,null,null,null,44600,null,null,null,82100,null,null,null,142700]
[null,null,"園児数101人以上の場合",null,null,null,null,null,null,null,null,null,null,null,12500,null,null,null,28600,null,null,null,38400,null,null,null,53000,null,null,null,99300,null,null,null,175100,null,null,null,null,null,null,null,"園児数101人以上の場合",null,null,null,null,null,null,null,null,null,null,null,12500,null,null,null,28600,null,null,null,38400,null,null,null,53000,null,null,null,99300,null,null,null,175100]

{"sheet":"管理者設定画面２","index":2,"n_rows":88,"n_cols":30,"rows_kept":88,"cut":false,"hidden":true,"merged":[[85,18,85,22],[86,18,87,19],[86,20,86,22],[87,20,87,22],[81,24,81,25],[81,26,81,27],[81,28,81,29],[82,20,82,23],[82,24,82,25],[82,26,82,27],[82,28,82,29],[79,18,79,23],[79,24,79,25],[79,26,79,27],[79,28,79,29],[80,18,82,19],[80,20,80,23],[80,24,80,25],[80,26,80,27],[80,28,80,29],[81,20,81,23],[72,28,72,30],[73,18,74,21],[73,22,74,24],[73,25,76,27],[73,28,76,30],[75,18,76,21],[75,22,76,24],[67,18,67,24],[67,25,67,27],[69,18,69,24],[69,25,69,27],[72,18,72,24],[72,25,72,27],[62,25,62,27],[62,28,62,30],[65,18,65,24],[65,25,66,27],[66,18,66,24],[59,18,59,24],[59,25,59,27],[59,28,59,30],[60,25,61,27],[60,28,61,30],[60,18,61,24],[62,18,62,24],[55,18,55,19],[55,20,55,23],[55,24,55,27],[55,28,55,31],[56,18,56,19],[56,20,56,23],[56,24,56,27],[56,28,56,31],[51,22,51,23],[51,24,51,25],[51,26,51,27],[51,28,51,29],[52,20,52,21],[52,22,52,23],[52,24,52,25],[52,26,52,27],[52,28,52,29],[49,22,49,23],[49,24,49,25],[49,26,49,27],[49,28,49,29],[50,19,52,19],[50,20,50,21],[50,22,50,23],[50,24,50,25],[50,26,50,27],[50,28,50,29],[47,22,47,23],[47,24,47,25],[47,26,47,27],[47,28,47,29],[48,19,48,21],[48,22,48,23],[48,24,48,25],[48,26,48,27],[48,28,48,29],[42,18,42,21],[43,18,45,18],[43,19,43,21],[44,19,44,21],[45,19,45,21],[47,19,47,21],[49,19,49,21],[51,20,51,21],[47,18,52,18],[38,18,38,19],[38,20,38,25],[38,26,38,31],[39,18,39,19],[39,20,39,22],[39,23,39,25],[39,26,39,28],[39,29,39,31],[36,18,36,19],[36,20,36,25],[36,26,36,31],[37,18,37,19],[37,20,37,25],[37,26,37,31],[34,18,34,19],[34,20,34,22],[34,23,34,25],[34,26,34,28],[34,29,34,31],[35,18,35,19],[35,20,35,25],[35,26,35,31],[30,18,30,19],[30,20,30,23],[30,24,30,27],[30,28,30,31],[31,18,31,19],[31,20,31,23],[31,24,31,27],[31,28,31,31],[26,18,26,19],[26,20,26,23],[26,24,26,27],[26,28,26,31],[27,18,27,19],[27,20,27,23],[27,24,27,27],[27,28,27,31],[24,18,24,19],[24,20,24,23],[24,24,24,27],[24,28,24,31],[25,18,25,19],[25,20,25,23],[25,24,25,27],[25,28,25,31],[22,18,22,19],[22,20,22,23],[22,24,22,27],[22,28,22,31],[23,18,23,19],[23,20,23,23],[23,24,23,27],[23,28,23,31],[20,18,20,19],[20,20,20,23],[20,24,20,27],[20,28,20,31],[21,18,21,19],[21,20,21,23],[21,24,21,27],[21,28,21,31],[18,18,18,19],[18,20,18,23],[18,24,18,27],[18,28,18,31],[19,18,19,19],[19,20,19,23],[19,24,19,27],[19,28,19,31],[14,18,14,19],[14,20,14,23],[14,24,14,27],[14,28,14,31],[15,18,15,19],[15,20,15,23],[15,24,15,27],[15,28,15,31],[12,20,12,23],[12,24,12,27],[12,28,12,31],[13,18,13,19],[13,20,13,23],[13,24,13,27],[13,28,13,31],[10,18,10,19],[10,20,10,23],[10,24,10,27],[10,28,10,31],[11,18,11,19],[11,20,11,23],[11,24,11,27],[11,28,11,31],[8,24,8,27],[8,28,8,31],[9,18,9,19],[9,20,9,23],[9,24,9,27],[9,28,9,31],[6,24,6,27],[6,28,6,31],[7,18,7,19],[7,20,7,23],[7,24,7,27],[7,28,7,31],[86,2,87,3],[86,4,86,6],[87,4,87,6],[3,18,3,20],[3,21,3,22],[6,18,6,19],[6,20,6,23],[8,18,8,19],[8,20,8,23],[81,8,81,9],[81,10,81,11],[81,12,81,13],[82,4,82,7],[82,8,82,9],[82,10,82,11],[82,12,82,13],[79,2,79,7],[79,8,79,9],[79,10,79,11],[79,12,79,13],[80,2,82,3],[80,4,80,7],[80,8,80,9],[12,18,12,19],[81,4,81,7],[72,12,72,14],[73,2,74,5],[73,6,74,8],[73,9,76,11],[73,12,76,14],[75,2,76,5],[75,6,76,8],[85,2,85,6],[67,2,67,8],[67,9,67,11],[69,2,69,8],[69,9,69,11],[72,2,72,8],[72,9,72,11],[62,9,62,11],[80,10,80,11],[80,12,80,13],[62,12,62,14],[65,2,65,8],[65,9,66,11],[66,2,66,8],[68,2,68,8],[68,9,68,11],[59,2,59,8],[59,9,59,11],[59,12,59,14],[60,9,61,11],[60,12,61,14],[60,2,61,8],[62,2,62,8],[50,11,50,12],[50,13,50,14],[55,2,55,3],[55,4,55,7],[55,8,55,11],[55,12,55,15],[56,2,56,3],[56,4,56,7],[56,8,56,11],[56,12,56,15],[51,7,51,8],[51,9,51,10],[51,11,51,12],[51,13,51,14],[52,4,52,5],[52,7,52,8],[52,9,52,10],[52,13,52,14],[47,11,47,12],[47,13,47,14],[48,3,48,5],[48,7,48,8],[48,9,48,10],[48,11,48,12],[48,13,48,14],[49,7,49,8],[49,9,49,10],[49,11,49,12],[49,13,49,14],[43,3,43,5],[44,3,44,5],[45,3,45,5],[47,3,47,5],[49,3,49,5],[51,4,51,5],[39,2,39,3],[39,4,39,6],[47,7,47,8],[50,3,52,3],[50,4,50,5],[50,7,50,8],[39,7,39,9],[47,9,47,10],[50,9,50,10],[47,2,52,2],[43,2,46,2],[46,3,46,5],[39,10,39,12],[52,11,52,12],[34,4,34,6],[34,7,34,9],[34,10,34,12],[34,13,34,15],[39,13,39,15],[42,2,42,5],[37,2,37,3],[37,4,37,9],[37,10,37,15],[38,2,38,3],[38,4,38,9],[38,10,38,15],[36,2,36,3],[36,4,36,9],[36,10,36,15],[35,2,35,3],[35,4,35,9],[35,10,35,15],[27,12,27,15],[30,2,30,3],[30,4,30,7],[30,8,30,11],[30,12,30,15],[25,2,25,3],[25,4,25,7],[25,8,25,11],[25,12,25,15],[26,2,26,3],[26,4,26,7],[26,8,26,11],[26,12,26,15],[27,2,27,3],[27,4,27,7],[27,8,27,11],[31,2,31,3],[31,4,31,7],[31,8,31,11],[31,12,31,15],[34,2,34,3],[23,12,23,15],[24,2,24,3],[24,4,24,7],[24,8,24,11],[24,12,24,15],[21,2,21,3],[21,4,21,7],[21,8,21,11],[21,12,21,15],[22,2,22,3],[22,4,22,7],[22,8,22,11],[22,12,22,15],[23,2,23,3],[23,4,23,7],[23,8,23,11],[19,12,19,15],[20,2,20,3],[20,4,20,7],[20,8,20,11],[20,12,20,15],[15,2,15,3],[15,4,15,7],[15,8,15,11],[15,12,15,15],[18,2,18,3],[18,4,18,7],[18,8,18,11],[18,12,18,15],[19,2,19,3],[19,4,19,7],[19,8,19,11],[13,12,13,15],[14,2,14,3],[14,4,14,7],[14,8,14,11],[14,12,14,15],[11,2,11,3],[11,4,11,7],[11,8,11,11],[11,12,11,15],[12,2,12,3],[12,4,12,7],[12,8,12,11],[12,12,12,15],[9,12,9,15],[10,2,10,3],[10,4,10,7],[10,8,10,11],[10,12,10,15],[6,12,6,15],[7,2,7,3],[7,4,7,7],[7,8,7,11],[7,12,7,15],[8,2,8,3],[8,4,8,7],[8,8,8,11],[8,12,8,15],[3,2,3,4],[3,5,3,6],[6,2,6,3],[6,4,6,7],[6,8,6,11],[9,2,9,3],[9,4,9,7],[9,8,9,11],[13,2,13,3],[13,4,13,7],[13,8,13,11]]}
[]
[null,"管理者設定画面２"]
[]
[null,null,"保険金額テーブル①",null,null,{"$f":"IF(管理者設定画面１!I4=\"\",\"\",管理者設定画面１!I4)","v":2025},null,"年度",null,null,null,null,null,null,null,null,null,null,"保険金額テーブル②",null,null,{"$f":"IF(管理者設定画面１!AW4=\"\",\"\",管理者設定画面１!AW4)","v":""},null,"年度","※単年対応とするため保険金額テーブル②は廃止とする"]
[]
[null,null,"プラン１　保育園児等傷害保険",null,null,null,null,null,null,null,null,null,null,null,null,null,null,null,"プラン１　保育園児等傷害保険"]
[null,null,"ご加入の型",null,"死亡・後遺障害保険金額",null,null,null,"入院保険金日額",null,null,null,"通院保険金日額",null,null,null,null,null,"ご加入の型",null,"死亡・後遺障害保険金額",null,null,null,"入院保険金日額",null,null,null,"通院保険金日額"]
[null,null,"A1・B1・C1",null,"９１６．０万円",null,null,null,"１４，０００円",null,null,null,"１０，０００円",null,null,null,null,null,"A1・B1・C1",null,"９１６．０万円",null,null,null,"１４，０００円",null,null,null,"１０，０００円"]
[null,null,"A2・B2・C2",null,"５７３．０万円",null,null,null,"８，５００円",null,null,null,"６，５００円",null,null,null,null,null,"A2・B2・C2",null,"５７３．０万円",null,null,null,"８，５００円",null,null,null,"６，５００円"]
[null,null,"A3・B3・C3",null,"４６０．０万円",null,null,null,"７，０００円",null,null,null,"５，０００円",null,null,null,null,null,"A3・B3・C3",null,"４６０．０万円",null,null,null,"７，０００円",null,null,null,"５，０００円"]
[null,null,"A4・B4・C4",null,"３４７．０万円",null,null,null,"５，５００円",null,null,null,"３，５００円",null,null,null,null,null,"A4・B4・C4",null,"３４７．０万円",null,null,null,"５，５００円",null,null,null,"３，５００円"]
[null,null,"A5・B5・C5",null,"２８８．４万円",null,null,null,"４，５００円",null,null,null,"３，０００円",null,null,null,null,null,"A5・B5・C5",null,"２８８．４万円",null,null,null,"４，５００円",null,null,null,"３，０００円"]
[null,null,"A6・B6・C6",null,"２２９．５万円",null,null,null,"３，５００円",null,null,null,"２，５００円",null,null,null,null,null,"A6・B6・C6",null,"２２９．５万円",null,null,null,"３，５００円",null,null,null,"２，５００円"]
[null,null,"A7・B7・C7",null,"１２０．０万円",null,null,null,"３，０００円",null,null,null,"２，０００円",null,null,null,null,null,"A7・B7・C7",null,"１２０．０万円",null,null,null,"３，０００円",null,null,null,"２，０００円"]
[null,null,"A8・B8・C8",null,"１２５．５万円",null,null,null,"２，２５０円",null,null,null,"１，５００円",null,null,null,null,null,"A8・B8・C8",null,"１２５．５万円",null,null,null,"２，２５０円",null,null,null,"１，５００円"]
[null,null,"A9・B9・C9",null,"１１３．０万円",null,null,null,"１，８００円",null,null,null,"１，３００円",null,null,null,null,null,"A9・B9・C9",null,"１１３．０万円",null,null,null,"１，８００円",null,null,null,"１，３００円"]
[]
[null,null,"プラン２　主催行事参加者傷害保険",null,null,null,null,null,null,null,null,null,null,null,null,null,null,null,"プラン２　主催行事参加者傷害保険"]
[null,null,"ご加入の型",null,"死亡・後遺障害保険金額",null,null,null,"入院保険金日額",null,null,null,"通院保険金日額",null,null,null,null,null,"ご加入の型",null,"死亡・後遺障害保険金額",null,null,null,"入院保険金日額",null,null,null,"通院保険金日額"]
[null,null,"A1・B1",null,"８００万円",null,null,null,"１２，０００円",null,null,null,"８，０００円",null,null,null,null,null,"A1・B1",null,"８００万円",null,null,null,"１２，０００円",null,null,null,"８，０００円"]
[null,null,"A2・B2",null,"５００万円",null,null,null,"７，５００円",null,null,null,"５，０００円",null,null,null,null,null,"A2・B2",null,"５００万円",null,null,null,"７，５００円",null,null,null,"５，０００円"]
[null,null,"A3・B3",null,"４００万円",null,null,null,"６，０００円",null,null,null,"４，０００円",null,null,null,null,null,"A3・B3",null,"４００万円",null,null,null,"６，０００円",null,null,null,"４，０００円"]
[null,null,"A4・B4",null,"３００万円",null,null,null,"４，５００円",null,null,null,"３，０００円",null,null,null,null,null,"A4・B4",null,"３００万円",null,null,null,"４，５００円",null,null,null,"３，０００円"]
[null,null,"A5・B5",null,"２５０万円",null,null,null,"３，７５０円",null,null,null,"２，５００円",null,null,null,null,null,"A5・B5",null,"２５０万円",null,null,null,"３，７５０円",null,null,null,"２，５００円"]
[null,null,"A6・B6",null,"２００万円",null,null,null,"３，０００円",null,null,null,"２，０００円",null,null,null,null,null,"A6・B6",null,"２００万円",null,null,null,"３，０００円",null,null,null,"２，０００円"]
[null,null,"A7・B7",null,"１５０万円",null,null,null,"２，２５０円",null,null,null,"１，５００円",null,null,null,null,null,"A7・B7",null,"１５０万円",null,null,null,"２，２５０円",null,null,null,"１，５００円"]
[null,null,"A8・B8",null,"１２０万円",null,null,null,"１，８００円",null,null,null,"１，２００円",null,null,null,null,null,"A8・B8",null,"１２０万円",null,null,null,"１，８００円",null,null,null,"１，２００円"]
[null,null,"A9・B9",null,"１００万円",null,null,null,"１，５００円",null,null,null,"１，０００円",null,null,null,null,null,"A9・B9",null,"１００万円",null,null,null,"１，５００円",null,null,null,"１，０００円"]
[]
[null,null,"プラン３　自動車搭乗中傷害保険",null,null,null,null,null,null,null,null,null,null,null,null,null,null,null,"プラン３　自動車搭乗中傷害保険"]
[null,null,null,null,"死亡・後遺障害保険金額",null,null,null,"入院保険金日額",null,null,null,"通院保険金日額",null,null,null,null,null,null,null,"死亡・後遺障害保険金額",null,null,null,"入院保険金日額",null,null,null,"通院保険金日額"]
[null,null,"自動車搭乗中",null,"２２３．４万円",null,null,null,"３，０００円",null,null,null,"２，０００円",null,null,null,null,null,"自動車搭乗中",null,"２２３．４万円",null,null,null,"３，０００円",null,null,null,"２，０００円"]
[]
[null,null,"プラン４　保育園職員労災上乗せ保険",null,null,null,null,null,null,null,null,null,null,null,null,null,null,null,"プラン４　保育園職員労災上乗せ保険"]
[null,null,"ご加入の型",null,"A型",null,null,"B型",null,null,"C型",null,null,"D型",null,null,null,null,"ご加入の型",null,"A型",null,null,"B型",null,null,"C型",null,null,"D型"]
[null,null,"死亡",null,"５００万円",null,null,null,null,null,"１，０００万円",null,null,null,null,null,null,null,"死亡",null,"５００万円",null,null,null,null,null,"１，０００万円"]
[null,null,"後遺障害",null,"等級に応じて５万円～５００万円",null,null,null,null,null,"等級に応じて２０万円～１，０００万円",null,null,null,null,null,null,null,"後遺障害",null,"等級に応じて５万円～５００万円",null,null,null,null,null,"等級に応じて２０万円～１，０００万円"]
[null,null,"休業（４日目以降）",null,"１，０００円",null,null,null,null,null,"２，０００円",null,null,null,null,null,null,null,"休業（４日目以降）",null,"１，０００円",null,null,null,null,null,"２，０００円"]
[null,null,"災害付帯費用",null,"４０・１０・５万円",null,null,null,null,null,"１００・２５・２５万円",null,null,null,null,null,null,null,"災害付帯費用",null,"４０・１０・５万円",null,null,null,null,null,"１００・２５・２５万円"]
[null,null,"使用者責任",null,"なし",null,null,"３億円（１人・１災害）",null,null,"なし",null,null,"３億円（１人・１災害）",null,null,null,null,"使用者責任",null,"なし",null,null,"３億円（１人・１災害）",null,null,"なし",null,null,"３億円（１人・１災害）"]
[]
[null,null,"プラン５　保育園賠償責任保険（重大事故対応費用保険）",null,null,null,null,null,null,null,null,null,null,null,null,null,null,null,"プラン５　保育園賠償責任保険（重大事故対応費用保険）"]
[null,null,"ご加入の型",null,null,null,"ＥＲ＋","ＥＲ","ＦＲ","Ｅ","Ｆ","ＧＲ","ＨＲ","Ｇ","Ｈ",null,null,null,"ご加入の型",null,null,null,"ＥＲ","ＦＲ","Ｅ","Ｆ","ＧＲ","ＨＲ","Ｇ","Ｈ"]
[null,null,"保険の\n対象","通常保育",null,null,"〇","〇","〇","〇","〇","〇","〇","〇","〇",null,null,null,"保険の\n対象","通常保育",null,null,"〇","〇","〇","〇","〇","〇","〇","〇"]
[null,null,null,"地域子育て支援事業等",null,null,"〇","〇","×","〇","×","〇","×","〇","×",null,null,null,null,"地域子育て支援事業等",null,null,"〇","×","〇","×","〇","×","〇","×"]
[null,null,null,"借用建物への補償",null,null,"〇","〇","〇","×","×","〇","〇","×","×",null,null,null,null,"借用建物への補償",null,null,"〇","〇","×","×","〇","〇","×","×"]
[null,null,null,"職員が行う専門職業行為",null,null,"〇","×","×","×","×","×","×","×","×"]
[null,null,"保険\n金額","対人賠償",null,null,"１０億円","１０億円",null,"１０億円",null,"７億円",null,"７億円",null,null,null,null,"保険\n金額","対人賠償",null,null,"１０億円",null,"１０億円",null,"７億円",null,"７億円"]
[null,null,null,"対物賠償",null,null,"１，０００万円","１，０００万円",null,"１，０００万円",null,"１，０００万円",null,"１，０００万円",null,null,null,null,null,"対物賠償",null,null,"１，０００万円",null,"１，０００万円",null,"１，０００万円",null,"１，０００万円"]
[null,null,null,"人格権侵害",null,null,"１億円","１億円",null,"１億円",null,"７，０００万円",null,"７，０００万円",null,null,null,null,null,"人格権侵害",null,null,"１億円",null,"１億円",null,"７，０００万円",null,"７，０００万円"]
[null,null,null,"受託者\n賠償","建物",null,"１，０００万円","１，０００万円",null,"ー",null,"１，０００万円",null,"ー",null,null,null,null,null,"受託者\n賠償","建物",null,"１，０００万円",null,"ー",null,"１，０００万円",null,"ー"]
[null,null,null,null,"現金・貴重品等",null,"１０万円","１０万円",null,"１０万円",null,"１０万円",null,"１０万円",null,null,null,null,null,null,"現金・貴重品等",null,"１０万円",null,"１０万円",null,"１０万円",null,"１０万円"]
[null,null,null,null,"上記以外",null,"１００万円","１００万円",null,"１００万円",null,"１００万円",null,"１００万円",null,null,null,null,null,null,"上記以外",null,"１００万円",null,"１００万円",null,"１００万円",null,"１００万円"]
[]
[null,null,"（オプション）クレーム対応費用保険",null,null,null,null,null,null,null,null,null,null,null,null,null,null,null,"（オプション）クレーム対応費用保険"]
[null,null,"ご加入の型",null,"Ｑ",null,null,null,"Ｒ",null,null,null,"Ｓ",null,null,null,null,null,"ご加入の型",null,"Ｑ",null,null,null,"Ｒ",null,null,null,"Ｓ"]
[null,null,"保険金額",null,"５０万円（１事故・１期間中）",null,null,null,"１５０万円（１事故・１期間中）",null,null,null,"３００万円（１事故・１期間中）",null,null,null,null,null,"保険金額",null,"５０万円（１事故・１期間中）",null,null,null,"１００万円（１事故・１期間中）",null,null,null,"１５０万円（１事故・１期間中）"]
[]
[null,null,"プラン６　個人情報漏えい対応保険",null,null,null,null,null,null,null,null,null,null,null,null,null,null,null,"プラン６　個人情報漏えい対応保険"]
[null,null,"ご加入の型",null,null,null,null,null,null,"Ｉ",null,null,"Ｊ",null,null,null,null,null,"ご加入の型",null,null,null,null,null,null,"Ｉ",null,null,"Ｊ"]
[null,null,"第三者の損害賠償に\n関する補償",null,null,null,null,null,null,"５，０００万円",null,null,"１億円",null,null,null,null,null,"第三者の損害賠償に\n関する補償",null,null,null,null,null,null,"５，０００万円",null,null,"１億円"]
[]
[null,null,"事故に関する各種対応費用",null,null,null,null,null,null,"１００万円",null,null,"２００万円",null,null,null,null,null,"事故に関する各種対応費用",null,null,null,null,null,null,"１００万円",null,null,"２００万円"]
[]
[null,null,"プラン７　保育業務従事者向け賠償責任保険",null,null,null,null,null,null,null,null,null,null,null,null,null,null,null,"プラン７　保育業務従事者向け賠償責任保険"]
[null,null,"対人・対物賠償",null,null,null,null,null,null,"１億円（１事故あたり）",null,null,null,null,null,null,null,null,"対人・対物賠償",null,null,null,null,null,null,"１億円（１事故あたり）"]
[null,null,"人格権侵害補償",null,null,null,null,null,null,null,null,null,null,null,null,null,null,null,"人格権侵害"]
[null,null,"初期対応費用",null,null,null,null,null,null,"１，０００万円（期間中）",null,null,null,null,null,null,null,null,"初期対応費用（事故対応特別費用）",null,null,null,null,null,null,"５００万円（期間中）"]
[null,null,"争訟対応費用",null,null,null,null,null,null,"５００万円（期間中）"]
[null,null,"お見舞金（被害者対応費用）",null,null,null,null,null,null,"死亡：１００万円\n死亡以外：１０万円\n期間中　５００万円",null,null,null,null,null,null,null,null,"お見舞金（被害者対応費用）",null,null,null,null,null,null,"死亡：１００万円\n死亡以外：１０万円"]
[]
[null,null,"プラン８　雇用関連賠償責任保険",null,null,null,null,null,null,null,null,null,null,null,null,null,null,null,"プラン８　雇用関連賠償責任保険"]
[null,null,"ご加入の型",null,null,null,null,null,null,"Ｔ",null,null,"Ｕ",null,null,null,null,null,"ご加入の型",null,null,null,null,null,null,"Ｔ",null,null,"Ｕ"]
[null,null,"法律上の損害賠償金",null,null,null,"損害賠償金・\n精神的苦痛に対する慰謝料",null,null,"１，０００万円",null,null,"２，０００万円",null,null,null,null,null,"法律上の損害賠償金",null,null,null,"損害賠償金・\n精神的苦痛に対する慰謝料",null,null,"１，０００万円",null,null,"２，０００万円"]
[]
[null,null,"争訟費用",null,null,null,"弁護士費用・証拠収集のために\n要した費用・文書作成費用",null,null,null,null,null,null,null,null,null,null,null,"争訟費用",null,null,null,"弁護士費用・証拠収集のために\n要した費用・文書作成費用"]
[]
[]
[null,null,"プラン９　社会福祉法人向け役員賠償責任保険",null,null,null,null,null,null,null,null,null,null,null,null,null,null,null,"プラン９　社会福祉法人向け役員賠償責任保険"]
[null,null,"ご加入の型",null,null,null,null,null,"Ｎ",null,"Ｏ",null,"Ｐ",null,null,null,null,null,"ご加入の型",null,null,null,null,null,"Ｎ",null,"Ｏ",null,"Ｐ"]
[null,null,"保険金額\n自己負担額なし",null,"役員賠償責任",null,null,null,"５，０００万円",null,"１億円",null,"３億円",null,null,null,null,null,"保険金額\n自己負担額なし",null,"役員賠償責任",null,null,null,"５，０００万円",null,"１億円",null,"３億円"]
[null,null,null,null,"法人調査費用（法人内調査費用）",null,null,null,"１，０００万円",null,"１，０００万円",null,"１，０００万円",null,null,null,null,null,null,null,"法人調査費用（法人内調査費用）",null,null,null,"１，０００万円",null,"１，０００万円",null,"１，０００万円"]
[null,null,null,null,"法人調査費用（第三者委員会対応費用）",null,null,null,"５，０００万円",null,"５，０００万円",null,"５，０００万円",null,null,null,null,null,null,null,"法人調査費用（第三者委員会対応費用）",null,null,null,"５，０００万円",null,"５，０００万円",null,"５，０００万円"]
[]
[null,null,"プラン１０　保育園動産（什器・備品）補償保険",null,null,null,null,null,null,null,null,null,null,null,null,null,null,null,"プラン１０　保育園動産（什器・備品）補償保険"]
[null,null,"ご加入の型",null,null,null,null,"Ｍ","Ｋ","Ｌ","ＭＥ","ＫＥ","ＬＥ",null,null,null,null,null,"ご加入の型",null,null,null,null,"Ｍ","Ｋ","Ｌ","ＭＥ","ＫＥ","ＬＥ"]
[null,null,"保険金額",null,"地震等以外（１事故）",null,null,"５０万円","１００万円","３００万円","５０万円","１００万円","３００万円",null,null,null,null,null,"保険金額",null,"地震等以外（１事故）",null,null,"５０万円","１００万円","３００万円","５０万円","１００万円","３００万円"]
[null,null,null,null,"地震等（保険期間中）",null,null,"×","×","×","５０万円","１００万円","３００万円",null,null,null,null,null,null,null,"地震等（保険期間中）",null,null,"×","×","×","５０万円","１００万円","３００万円"]

{"sheet":"プラン選択画面","index":3,"n_rows":87,"n_cols":52,"rows_kept":87,"cut":false,"hidden":true,"merged":[[81,49,81,50],[84,39,84,43],[85,39,86,40],[85,41,85,43],[86,41,86,43],[78,39,78,44],[78,45,78,46],[78,47,78,48],[78,49,78,50],[79,39,81,40],[79,41,79,44],[79,45,79,46],[79,47,79,48],[79,49,79,50],[80,41,80,44],[80,45,80,46],[80,47,80,48],[80,49,80,50],[81,41,81,44],[81,45,81,46],[81,47,81,48],[64,39,64,45],[64,46,65,48],[65,39,65,45],[59,46,60,48],[59,49,60,51],[71,49,71,51],[72,39,73,42],[72,43,73,45],[72,46,75,48],[72,49,75,51],[74,39,75,42],[74,43,75,45],[66,39,66,45],[66,46,66,48],[68,39,68,45],[68,46,68,48],[71,39,71,45],[71,46,71,48],[67,39,67,45],[67,46,67,48],[58,39,58,45],[58,46,58,48],[58,49,58,51],[51,50,51,51],[54,39,54,40],[54,41,54,44],[54,45,54,48],[54,49,54,52],[61,46,61,48],[61,49,61,51],[59,39,60,45],[61,39,61,45],[55,39,55,40],[55,41,55,44],[55,45,55,48],[55,49,55,52],[46,39,51,39],[48,40,48,42],[48,44,48,45],[48,46,48,47],[48,48,48,49],[48,50,48,51],[49,40,51,40],[49,41,49,42],[51,41,51,42],[51,44,51,45],[51,46,51,47],[51,48,51,49],[46,50,46,51],[47,40,47,42],[47,44,47,45],[47,46,47,47],[47,48,47,49],[47,50,47,51],[46,40,46,42],[46,44,46,45],[46,46,46,47],[46,48,46,49],[49,44,49,45],[49,46,49,47],[49,48,49,49],[49,50,49,51],[50,41,50,42],[50,44,50,45],[50,46,50,47],[50,48,50,49],[50,50,50,51],[41,39,41,42],[42,40,42,42],[43,40,43,42],[44,40,44,42],[38,39,38,40],[38,41,38,43],[38,44,38,46],[38,47,38,49],[42,39,45,39],[45,40,45,42],[38,50,38,52],[36,39,36,40],[36,41,36,46],[36,47,36,52],[37,39,37,40],[37,41,37,46],[37,47,37,52],[34,39,34,40],[34,41,34,46],[34,47,34,52],[35,39,35,40],[35,41,35,46],[35,47,35,52],[33,39,33,40],[33,41,33,43],[33,44,33,46],[33,47,33,49],[33,50,33,52],[29,39,29,40],[29,41,29,44],[29,45,29,48],[29,49,29,52],[30,39,30,40],[30,41,30,44],[30,45,30,48],[30,49,30,52],[25,39,25,40],[25,41,25,44],[25,45,25,48],[25,49,25,52],[26,39,26,40],[26,41,26,44],[26,45,26,48],[26,49,26,52],[23,39,23,40],[23,41,23,44],[23,45,23,48],[23,49,23,52],[24,39,24,40],[24,41,24,44],[24,45,24,48],[24,49,24,52],[21,39,21,40],[21,41,21,44],[21,45,21,48],[21,49,21,52],[22,39,22,40],[22,41,22,44],[22,45,22,48],[22,49,22,52],[19,39,19,40],[19,41,19,44],[19,45,19,48],[19,49,19,52],[20,39,20,40],[20,41,20,44],[20,45,20,48],[20,49,20,52],[17,39,17,40],[17,41,17,44],[17,45,17,48],[17,49,17,52],[18,39,18,40],[18,41,18,44],[18,45,18,48],[18,49,18,52],[13,39,13,40],[13,41,13,44],[13,45,13,48],[13,49,13,52],[14,39,14,40],[14,41,14,44],[14,45,14,48],[14,49,14,52],[11,39,11,40],[11,41,11,44],[11,45,11,48],[11,49,11,52],[12,39,12,40],[12,41,12,44],[12,45,12,48],[12,49,12,52],[9,39,9,40],[9,41,9,44],[9,45,9,48],[9,49,9,52],[10,39,10,40],[10,41,10,44],[10,45,10,48],[10,49,10,52],[7,39,7,40],[7,41,7,44],[7,45,7,48],[7,49,7,52],[8,39,8,40],[8,41,8,44],[8,45,8,48],[8,49,8,52],[5,39,5,40],[5,41,5,44],[5,45,5,48],[5,49,5,52],[6,39,6,40],[6,41,6,44],[6,45,6,48],[6,49,6,52],[0,1,1,24],[36,9,36,12],[36,25,36,28],[35,5,35,8],[35,9,35,12],[35,21,35,24],[35,25,35,28],[26,20,26,23],[26,27,26,30],[27,20,27,23],[27,31,27,34],[26,31,26,34],[18,31,18,34],[26,16,26,19],[10,5,10,8],[10,9,10,12],[10,16,10,19],[10,20,10,23],[18,27,18,30],[11,9,11,12],[11,20,11,23],[18,5,18,8],[18,9,18,12],[18,16,18,19],[18,20,18,23],[19,9,19,12],[19,20,19,23],[19,31,19,34]]}
[null,"STEP１＜　プラン選択　＞　補償したいプランを選択してください。"]
[]
[]
[null,null,null,null,null,null,null,null,"新規加入",null,null,null,null,null,null,null,null,"継続加入"]
[null,null,null,null,null,null,null,null,null,null,null,null,null,null,null,null,null,null,null,null,null,null,null,null,null,null,null,null,null,null,null,null,null,null,null,null,null,null,null,"プラン１　保育園児等傷害保険"]
[null,null,null,null,null,null,null,null,null,null,null,null,null,null,null,null,null,null,null,null,null,null,null,null,null,null,null,null,null,null,null,null,null,null,null,null,null,null,null,"ご加入の型",null,"死亡・後遺障害保険金額",null,null,null,"入院保険金日額",null,null,null,"通院保険金日額"]
[null,null,null,null,null,null,null,null,null,null,null,null,null,null,null,null,null,null,null,null,null,null,null,null,null,null,null,null,null,null,null,null,null,null,null,null,null,null,null,"A1・B1・C1",null,{"$f":"IF(wkTblNo=\"①\",管理者設定画面２!E8,IF(wkTblNo=\"②\",管理者設定画面２!U8,\"\"))","v":"９１６．０万円"},null,null,null,{"$f":"IF(wkTblNo=\"①\",管理者設定画面２!I8,IF(wkTblNo=\"②\",管理者設定画面２!Y8,\"\"))","v":"１４，０００円"},null,null,null,{"$f":"IF(wkTblNo=\"①\",管理者設定画面２!M8,IF(wkTblNo=\"②\",管理者設定画面２!AC8,\"\"))","v":"１０，０００円"}]
[null,null,null,null,null,null,null,null,null,null,null,null,null,null,null,null,null,null,null,null,null,null,null,null,null,null,null,null,null,null,null,null,null,null,null,null,null,null,null,"A2・B2・C2",null,{"$f":"IF(wkTblNo=\"①\",管理者設定画面２!E9,IF(wkTblNo=\"②\",管理者設定画面２!U9,\"\"))","v":"５７３．０万円"},null,null,null,{"$f":"IF(wkTblNo=\"①\",管理者設定画面２!I9,IF(wkTblNo=\"②\",管理者設定画面２!Y9,\"\"))","v":"８，５００円"},null,null,null,{"$f":"IF(wkTblNo=\"①\",管理者設定画面２!M9,IF(wkTblNo=\"②\",管理者設定画面２!AC9,\"\"))","v":"６，５００円"}]
[null,null,null,null,null,null,null,null,null,null,null,null,null,null,null,null,null,null,null,null,null,null,null,null,null,null,null,null,null,null,null,null,null,null,null,null,null,null,null,"A3・B3・C3",null,{"$f":"IF(wkTblNo=\"①\",管理者設定画面２!E10,IF(wkTblNo=\"②\",管理者設定画面２!U10,\"\"))","v":"４６０．０万円"},null,null,null,{"$f":"IF(wkTblNo=\"①\",管理者設定画面２!I10,IF(wkTblNo=\"②\",管理者設定画面２!Y10,\"\"))","v":"７，０００円"},null,null,null,{"$f":"IF(wkTblNo=\"①\",管理者設定画面２!M10,IF(wkTblNo=\"②\",管理者設定画面２!AC10,\"\"))","v":"５，０００円"}]
[null,null,null,null,null,null,null,null,null,null,null,null,null,null,null,null,null,null,null,null,null,null,null,null,null,null,null,null,null,null,null,null,null,null,null,null,null,null,null,"A4・B4・C4",null,{"$f":"IF(wkTblNo=\"①\",管理者設定画面２!E11,IF(wkTblNo=\"②\",管理者設定画面２!U11,\"\"))","v":"３４７．０万円"},null,null,null,{"$f":"IF(wkTblNo=\"①\",管理者設定画面２!I11,IF(wkTblNo=\"②\",管理者設定画面２!Y11,\"\"))","v":"５，５００円"},null,null,null,{"$f":"IF(wkTblNo=\"①\",管理者設定画面２!M11,IF(wkTblNo=\"②\",管理者設定画面２!AC11,\"\"))","v":"３，５００円"}]
[null,null,null,null,null,"プラン１型選択",null,null,null,null,null,null,null,null,null,null,"プラン２型選択",null,null,null,null,null,null,null,null,null,null,null,null,null,null,null,null,null,null,null,null,null,null,"A5・B5・C5",null,{"$f":"IF(wkTblNo=\"①\",管理者設定画面２!E12,IF(wkTblNo=\"②\",管理者設定画面２!U12,\"\"))","v":"２８８．４万円"},null,null,null,{"$f":"IF(wkTblNo=\"①\",管理者設定画面２!I12,IF(wkTblNo=\"②\",管理者設定画面２!Y12,\"\"))","v":"４，５００円"},null,null,null,{"$f":"IF(wkTblNo=\"①\",管理者設定画面２!M12,IF(wkTblNo=\"②\",管理者設定画面２!AC12,\"\"))","v":"３，０００円"}]
[null,null,null,null,null,null,null,null,null,null,null,null,null,null,null,null,null,null,null,null,null,null,null,null,null,null,null,null,null,null,null,null,null,null,null,null,null,null,null,"A6・B6・C6",null,{"$f":"IF(wkTblNo=\"①\",管理者設定画面２!E13,IF(wkTblNo=\"②\",管理者設定画面２!U13,\"\"))","v":"２２９．５万円"},null,null,null,{"$f":"IF(wkTblNo=\"①\",管理者設定画面２!I13,IF(wkTblNo=\"②\",管理者設定画面２!Y13,\"\"))","v":"３，５００円"},null,null,null,{"$f":"IF(wkTblNo=\"①\",管理者設定画面２!M13,IF(wkTblNo=\"②\",管理者設定画面２!AC13,\"\"))","v":"２，５００円"}]
[null,null,null,null,null,null,null,null,null,null,null,null,null,null,null,null,null,null,null,null,null,null,null,null,null,null,null,null,null,null,null,null,null,null,null,null,null,null,null,"A7・B7・C7",null,{"$f":"IF(wkTblNo=\"①\",管理者設定画面２!E14,IF(wkTblNo=\"②\",管理者設定画面２!U14,\"\"))","v":"１２０．０万円"},null,null,null,{"$f":"IF(wkTblNo=\"①\",管理者設定画面２!I14,IF(wkTblNo=\"②\",管理者設定画面２!Y14,\"\"))","v":"３，０００円"},null,null,null,{"$f":"IF(wkTblNo=\"①\",管理者設定画面２!M14,IF(wkTblNo=\"②\",管理者設定画面２!AC14,\"\"))","v":"２，０００円"}]
[null,null,null,null,null,null,null,null,null,null,null,null,null,null,null,null,null,null,null,null,null,null,null,null,null,null,null,null,null,null,null,null,null,null,null,null,null,null,null,"A8・B8・C8",null,{"$f":"IF(wkTblNo=\"①\",管理者設定画面２!E15,IF(wkTblNo=\"②\",管理者設定画面２!U15,\"\"))","v":"１２５．５万円"},null,null,null,{"$f":"IF(wkTblNo=\"①\",管理者設定画面２!I15,IF(wkTblNo=\"②\",管理者設定画面２!Y15,\"\"))","v":"２，２５０円"},null,null,null,{"$f":"IF(wkTblNo=\"①\",管理者設定画面２!M15,IF(wkTblNo=\"②\",管理者設定画面２!AC15,\"\"))","v":"１，５００円"}]
[null,null,null,null,null,null,null,null,null,null,null,null,null,null,null,null,null,null,null,null,null,null,null,null,null,null,null,null,null,null,null,null,null,null,null,null,null,null,null,"A9・B9・C9",null,{"$f":"IF(wkTblNo=\"①\",管理者設定画面２!E16,IF(wkTblNo=\"②\",管理者設定画面２!U16,\"\"))","v":"１１３．０万円"},null,null,null,{"$f":"IF(wkTblNo=\"①\",管理者設定画面２!I16,IF(wkTblNo=\"②\",管理者設定画面２!Y16,\"\"))","v":"１，８００円"},null,null,null,{"$f":"IF(wkTblNo=\"①\",管理者設定画面２!M16,IF(wkTblNo=\"②\",管理者設定画面２!AC16,\"\"))","v":"１，３００円"}]
[]
[null,null,null,null,null,null,null,null,null,null,null,null,null,null,null,null,null,null,null,null,null,null,null,null,null,null,null,null,null,null,null,null,null,null,null,null,null,null,null,"プラン２　主催行事参加者傷害保険"]
[null,null,null,null,null,null,null,null,null,null,null,null,null,null,null,null,null,null,null,null,null,null,null,null,null,null,null,null,null,null,null,null,null,null,null,null,null,null,null,"ご加入の型",null,"死亡・後遺障害保険金額",null,null,null,"入院保険金日額",null,null,null,"通院保険金日額"]
[null,null,null,null,null,"プラン５型選択",null,null,null,null,null,null,null,null,null,null,"オプション型選択",null,null,null,null,null,null,null,null,null,null,"プラン６型選択",null,null,null,null,null,null,null,null,null,null,null,"A1・B1",null,{"$f":"IF(wkTblNo=\"①\",管理者設定画面２!E20,IF(wkTblNo=\"②\",管理者設定画面２!U20,\"\"))","v":"８００万円"},null,null,null,{"$f":"IF(wkTblNo=\"①\",管理者設定画面２!I20,IF(wkTblNo=\"②\",管理者設定画面２!Y20,\"\"))","v":"１２，０００円"},null,null,null,{"$f":"IF(wkTblNo=\"①\",管理者設定画面２!M20,IF(wkTblNo=\"②\",管理者設定画面２!AC20,\"\"))","v":"８，０００円"}]
[null,null,null,null,null,null,null,null,null,null,null,null,null,null,null,null,null,null,null,null,null,null,null,null,null,null,null,null,null,null,null,null,null,null,null,null,null,null,null,"A2・B2",null,{"$f":"IF(wkTblNo=\"①\",管理者設定画面２!E21,IF(wkTblNo=\"②\",管理者設定画面２!U21,\"\"))","v":"５００万円"},null,null,null,{"$f":"IF(wkTblNo=\"①\",管理者設定画面２!I21,IF(wkTblNo=\"②\",管理者設定画面２!Y21,\"\"))","v":"７，５００円"},null,null,null,{"$f":"IF(wkTblNo=\"①\",管理者設定画面２!M21,IF(wkTblNo=\"②\",管理者設定画面２!AC21,\"\"))","v":"５，０００円"}]
[null,null,null,null,null,null,null,null,null,null,null,null,null,null,null,null,null,null,null,null,null,null,null,null,null,null,null,null,null,null,null,null,null,null,null,null,null,null,null,"A3・B3",null,{"$f":"IF(wkTblNo=\"①\",管理者設定画面２!E22,IF(wkTblNo=\"②\",管理者設定画面２!U22,\"\"))","v":"４００万円"},null,null,null,{"$f":"IF(wkTblNo=\"①\",管理者設定画面２!I22,IF(wkTblNo=\"②\",管理者設定画面２!Y22,\"\"))","v":"６，０００円"},null,null,null,{"$f":"IF(wkTblNo=\"①\",管理者設定画面２!M22,IF(wkTblNo=\"②\",管理者設定画面２!AC22,\"\"))","v":"４，０００円"}]
[null,null,null,null,null,null,null,null,null,null,null,null,null,null,null,null,null,null,null,null,null,null,null,null,null,null,null,null,null,null,null,null,null,null,null,null,null,null,null,"A4・B4",null,{"$f":"IF(wkTblNo=\"①\",管理者設定画面２!E23,IF(wkTblNo=\"②\",管理者設定画面２!U23,\"\"))","v":"３００万円"},null,null,null,{"$f":"IF(wkTblNo=\"①\",管理者設定画面２!I23,IF(wkTblNo=\"②\",管理者設定画面２!Y23,\"\"))","v":"４，５００円"},null,null,null,{"$f":"IF(wkTblNo=\"①\",管理者設定画面２!M23,IF(wkTblNo=\"②\",管理者設定画面２!AC23,\"\"))","v":"３，０００円"}]
[null,null,null,null,null,null,null,null,null,null,null,null,null,null,null,null,null,null,null,null,null,null,null,null,null,null,null,null,null,null,null,null,null,null,null,null,null,null,null,"A5・B5",null,{"$f":"IF(wkTblNo=\"①\",管理者設定画面２!E24,IF(wkTblNo=\"②\",管理者設定画面２!U24,\"\"))","v":"２５０万円"},null,null,null,{"$f":"IF(wkTblNo=\"①\",管理者設定画面２!I24,IF(wkTblNo=\"②\",管理者設定画面２!Y24,\"\"))","v":"３，７５０円"},null,null,null,{"$f":"IF(wkTblNo=\"①\",管理者設定画面２!M24,IF(wkTblNo=\"②\",管理者設定画面２!AC24,\"\"))","v":"２，５００円"}]
[null,null,null,null,null,null,null,null,null,null,null,null,null,null,null,null,null,null,null,null,null,null,null,null,null,null,null,null,null,null,null,null,null,null,null,null,null,null,null,"A6・B6",null,{"$f":"IF(wkTblNo=\"①\",管理者設定画面２!E25,IF(wkTblNo=\"②\",管理者設定画面２!U25,\"\"))","v":"２００万円"},null,null,null,{"$f":"IF(wkTblNo=\"①\",管理者設定画面２!I25,IF(wkTblNo=\"②\",管理者設定画面２!Y25,\"\"))","v":"３，０００円"},null,null,null,{"$f":"IF(wkTblNo=\"①\",管理者設定画面２!M25,IF(wkTblNo=\"②\",管理者設定画面２!AC25,\"\"))","v":"２，０００円"}]
[null,null,null,null,null,null,null,null,null,null,null,null,null,null,null,null,null,null,null,null,null,null,null,null,null,null,null,null,null,null,null,null,null,null,null,null,null,null,null,"A7・B7",null,{"$f":"IF(wkTblNo=\"①\",管理者設定画面２!E26,IF(wkTblNo=\"②\",管理者設定画面２!U26,\"\"))","v":"１５０万円"},null,null,null,{"$f":"IF(wkTblNo=\"①\",管理者設定画面２!I26,IF(wkTblNo=\"②\",管理者設定画面２!Y26,\"\"))","v":"２，２５０円"},null,null,null,{"$f":"IF(wkTblNo=\"①\",管理者設定画面２!M26,IF(wkTblNo=\"②\",管理者設定画面２!AC26,\"\"))","v":"１，５００円"}]
[null,null,null,null,null,null,null,null,null,null,null,null,null,null,null,null,null,null,null,null,null,null,null,null,null,null,null,null,null,null,null,null,null,null,null,null,null,null,null,"A8・B8",null,{"$f":"IF(wkTblNo=\"①\",管理者設定画面２!E27,IF(wkTblNo=\"②\",管理者設定画面２!U27,\"\"))","v":"１２０万円"},null,null,null,{"$f":"IF(wkTblNo=\"①\",管理者設定画面２!I27,IF(wkTblNo=\"②\",管理者設定画面２!Y27,\"\"))","v":"１，８００円"},null,null,null,{"$f":"IF(wkTblNo=\"①\",管理者設定画面２!M27,IF(wkTblNo=\"②\",管理者設定画面２!AC27,\"\"))","v":"１，２００円"}]
[null,null,null,null,null,null,null,null,null,null,null,null,null,null,null,null,"プラン８型選択",null,null,null,null,null,null,null,null,null,null,"プラン９型選択",null,null,null,null,null,null,null,null,null,null,null,"A9・B9",null,{"$f":"IF(wkTblNo=\"①\",管理者設定画面２!E28,IF(wkTblNo=\"②\",管理者設定画面２!U28,\"\"))","v":"１００万円"},null,null,null,{"$f":"IF(wkTblNo=\"①\",管理者設定画面２!I28,IF(wkTblNo=\"②\",管理者設定画面２!Y28,\"\"))","v":"１，５００円"},null,null,null,{"$f":"IF(wkTblNo=\"①\",管理者設定画面２!M28,IF(wkTblNo=\"②\",管理者設定画面２!AC28,\"\"))","v":"１，０００円"}]
[]
[null,null,null,null,null,null,null,null,null,null,null,null,null,null,null,null,null,null,null,null,null,null,null,null,null,null,null,null,null,null,null,null,null,null,null,null,null,null,null,"プラン３　自動車搭乗中傷害保険"]
[null,null,null,null,null,null,null,null,null,null,null,null,null,null,null,null,null,null,null,null,null,null,null,null,null,null,null,null,null,null,null,null,null,null,null,null,null,null,null,null,null,"死亡・後遺障害保険金額",null,null,null,"入院保険金日額",null,null,null,"通院保険金日額"]
[null,null,null,null,null,null,null,null,null,null,null,null,null,null,null,null,null,null,null,null,null,null,null,null,null,null,null,null,null,null,null,null,null,null,null,null,null,null,null,"自動車搭乗中",null,{"$f":"IF(wkTblNo=\"①\",管理者設定画面２!E32,IF(wkTblNo=\"②\",管理者設定画面２!U32,\"\"))","v":"２２３．４万円"},null,null,null,{"$f":"IF(wkTblNo=\"①\",管理者設定画面２!I32,IF(wkTblNo=\"②\",管理者設定画面２!Y32,\"\"))","v":"３，０００円"},null,null,null,{"$f":"IF(wkTblNo=\"①\",管理者設定画面２!M32,IF(wkTblNo=\"②\",管理者設定画面２!AC32,\"\"))","v":"２，０００円"}]
[]
[null,null,null,null,null,null,null,null,null,null,null,null,null,null,null,null,null,null,null,null,null,null,null,null,null,null,null,null,null,null,null,null,null,null,null,null,null,null,null,"プラン４　保育園職員労災上乗せ保険"]
[null,null,null,null,null,null,null,null,null,null,null,null,null,null,null,null,null,null,null,null,null,null,null,null,null,null,null,null,null,null,null,null,null,null,null,null,null,null,null,"ご加入の型",null,"A型",null,null,"B型",null,null,"C型",null,null,"D型"]
[null,null,null,null,null,null,null,null,null,null,null,null,null,null,null,null,null,null,null,null,null,null,null,null,null,null,null,null,null,null,null,null,null,null,null,null,null,null,null,"死亡",null,{"$f":"IF(wkTblNo=\"①\",管理者設定画面２!E36,IF(wkTblNo=\"②\",管理者設定画面２!U36,\"\"))","v":"５００万円"},null,null,null,null,null,{"$f":"IF(wkTblNo=\"①\",管理者設定画面２!K36,IF(wkTblNo=\"②\",管理者設定画面２!AA36,\"\"))","v":"１，０００万円"}]
[null,null,null,null,null,"プラン４型選択",null,null,null,null,null,null,null,null,null,null,null,null,null,null,null,"プラン10型選択",null,null,null,null,null,null,null,null,null,null,null,null,null,null,null,null,null,"後遺障害",null,{"$f":"IF(wkTblNo=\"①\",管理者設定画面２!E37,IF(wkTblNo=\"②\",管理者設定画面２!U37,\"\"))","v":"等級に応じて５万円～５００万円"},null,null,null,null,null,{"$f":"IF(wkTblNo=\"①\",管理者設定画面２!K37,IF(wkTblNo=\"②\",管理者設定画面２!AA37,\"\"))","v":"等級に応じて２０万円～１，０００万円"}]
[null,null,null,null,null,null,null,null,null,null,null,null,null,null,null,null,null,null,null,null,null,null,null,null,null,null,null,null,null,null,null,null,null,null,null,null,null,null,null,"休業（４日目以降）",null,{"$f":"IF(wkTblNo=\"①\",管理者設定画面２!E38,IF(wkTblNo=\"②\",管理者設定画面２!U38,\"\"))","v":"１，０００円"},null,null,null,null,null,{"$f":"IF(wkTblNo=\"①\",管理者設定画面２!K38,IF(wkTblNo=\"②\",管理者設定画面２!AA38,\"\"))","v":"２，０００円"}]
[null,null,null,null,null,null,null,null,null,null,null,null,null,null,null,null,null,null,null,null,null,null,null,null,null,null,null,null,null,null,null,null,null,null,null,null,null,null,null,"災害付帯費用",null,{"$f":"IF(wkTblNo=\"①\",管理者設定画面２!E39,IF(wkTblNo=\"②\",管理者設定画面２!U39,\"\"))","v":"４０・１０・５万円"},null,null,null,null,null,{"$f":"IF(wkTblNo=\"①\",管理者設定画面２!K39,IF(wkTblNo=\"②\",管理者設定画面２!AA39,\"\"))","v":"１００・２５・２５万円"}]
[null,null,null,null,null,null,null,null,null,null,null,null,null,null,null,null,null,null,null,null,null,null,null,null,null,null,null,null,null,null,null,null,null,null,null,null,null,null,null,"使用者責任",null,{"$f":"IF(wkTblNo=\"①\",管理者設定画面２!E40,IF(wkTblNo=\"②\",管理者設定画面２!U40,\"\"))","v":"なし"},null,null,{"$f":"IF(wkTblNo=\"①\",管理者設定画面２!H40,IF(wkTblNo=\"②\",管理者設定画面２!X40,\"\"))","v":"３億円（１人・１災害）"},null,null,{"$f":"IF(wkTblNo=\"①\",管理者設定画面２!K40,IF(wkTblNo=\"②\",管理者設定画面２!AA40,\"\"))","v":"なし"},null,null,{"$f":"IF(wkTblNo=\"①\",管理者設定画面２!N40,IF(wkTblNo=\"②\",管理者設定画面２!AD40,\"\"))","v":"３億円（１人・１災害）"}]
[]
[null,null,null,null,null,null,null,null,null,null,null,null,null,null,null,null,null,null,null,null,null,null,null,null,null,null,null,null,null,null,null,null,null,null,null,null,null,null,null,"プラン５　保育園賠償責任保険（重大事故対応費用保険）"]
[null,null,null,null,null,null,null,null,null,null,null,null,null,null,null,null,null,null,null,null,null,null,null,null,null,null,null,null,null,null,null,null,null,null,null,null,null,null,null,"ご加入の型",null,null,null,"ＥＲ＋","ＥＲ","ＦＲ","Ｅ","Ｆ","ＧＲ","ＨＲ","Ｇ","Ｈ"]
[null,null,null,null,null,null,null,null,null,null,null,null,null,null,null,null,null,null,null,null,null,null,null,null,null,null,null,null,null,null,null,null,null,null,null,null,null,null,null,"保険の\n対象","通常保育",null,null,"〇","〇","〇","〇","〇","〇","〇","〇","〇"]
[null,null,null,null,null,null,null,null,null,null,null,null,null,null,null,null,null,null,null,null,null,null,null,null,null,null,null,null,null,null,null,null,null,null,null,null,null,null,null,null,"地域子育て支援事業等",null,null,"〇","〇","×","〇","×","〇","×","〇","×"]
[null,null,null,null,null,null,null,null,null,null,null,null,null,null,null,null,null,null,null,null,null,null,null,null,null,null,null,null,null,null,null,null,null,null,null,null,null,null,null,null,"借用建物への補償",null,null,"〇","〇","〇","×","×","〇","〇","×","×"]
[null,null,null,null,null,null,null,null,null,null,null,null,null,null,null,null,null,null,null,null,null,null,null,null,null,null,null,null,null,null,null,null,null,null,null,null,null,null,null,null,"職員が行う専門職業行為",null,null,"〇","×","×","×","×","×","×","×","×"]
[null,null,null,null,null,null,null,null,null,null,null,null,null,null,null,null,null,null,null,null,null,null,null,null,null,null,null,null,null,null,null,null,null,null,null,null,null,null,null,"保険\n金額","対人賠償",null,null,{"$f":"IF(wkTblNo=\"①\",管理者設定画面２!G48,\"\")","v":"１０億円"},{"$f":"IF(wkTblNo=\"①\",管理者設定画面２!H48,IF(wkTblNo=\"②\",管理者設定画面２!W48,\"\"))","v":"１０億円"},null,{"$f":"IF(wkTblNo=\"①\",管理者設定画面２!J48,IF(wkTblNo=\"②\",管理者設定画面２!Y48,\"\"))","v":"１０億円"},null,{"$f":"IF(wkTblNo=\"①\",管理者設定画面２!L48,IF(wkTblNo=\"②\",管理者設定画面２!AA48,\"\"))","v":"７億円"},null,{"$f":"IF(wkTblNo=\"①\",管理者設定画面２!N48,IF(wkTblNo=\"②\",管理者設定画面２!AC48,\"\"))","v":"７億円"}]
[null,null,null,null,null,null,null,null,null,null,null,null,null,null,null,null,null,null,null,null,null,null,null,null,null,null,null,null,null,null,null,null,null,null,null,null,null,null,null,null,"対物賠償",null,null,{"$f":"IF(wkTblNo=\"①\",管理者設定画面２!G49,\"\")","v":"１，０００万円"},{"$f":"IF(wkTblNo=\"①\",管理者設定画面２!H49,IF(wkTblNo=\"②\",管理者設定画面２!W49,\"\"))","v":"１，０００万円"},null,{"$f":"IF(wkTblNo=\"①\",管理者設定画面２!J49,IF(wkTblNo=\"②\",管理者設定画面２!Y49,\"\"))","v":"１，０００万円"},null,{"$f":"IF(wkTblNo=\"①\",管理者設定画面２!L49,IF(wkTblNo=\"②\",管理者設定画面２!AA49,\"\"))","v":"１，０００万円"},null,{"$f":"IF(wkTblNo=\"①\",管理者設定画面２!N49,IF(wkTblNo=\"②\",管理者設定画面２!AC49,\"\"))","v":"１，０００万円"}]
[null,null,null,null,null,null,null,null,null,null,null,null,null,null,null,null,null,null,null,null,null,null,null,null,null,null,null,null,null,null,null,null,null,null,null,null,null,null,null,null,"人格権侵害",null,null,{"$f":"IF(wkTblNo=\"①\",管理者設定画面２!G50,\"\")","v":"１億円"},{"$f":"IF(wkTblNo=\"①\",管理者設定画面２!H50,IF(wkTblNo=\"②\",管理者設定画面２!W50,\"\"))","v":"１億円"},null,{"$f":"IF(wkTblNo=\"①\",管理者設定画面２!J50,IF(wkTblNo=\"②\",管理者設定画面２!Y50,\"\"))","v":"１億円"},null,{"$f":"IF(wkTblNo=\"①\",管理者設定画面２!L50,IF(wkTblNo=\"②\",管理者設定画面２!AA50,\"\"))","v":"７，０００万円"},null,{"$f":"IF(wkTblNo=\"①\",管理者設定画面２!N50,IF(wkTblNo=\"②\",管理者設定画面２!AC50,\"\"))","v":"７，０００万円"}]
[null,null,null,null,null,null,null,null,null,null,null,null,null,null,null,null,null,null,null,null,null,null,null,null,null,null,null,null,null,null,null,null,null,null,null,null,null,null,null,null,"受託者\n賠償","建物",null,{"$f":"IF(wkTblNo=\"①\",管理者設定画面２!G51,\"\")","v":"１，０００万円"},{"$f":"IF(wkTblNo=\"①\",管理者設定画面２!H51,IF(wkTblNo=\"②\",管理者設定画面２!W51,\"\"))","v":"１，０００万円"},null,{"$f":"IF(wkTblNo=\"①\",管理者設定画面２!J51,IF(wkTblNo=\"②\",管理者設定画面２!Y51,\"\"))","v":"ー"},null,{"$f":"IF(wkTblNo=\"①\",管理者設定画面２!L51,IF(wkTblNo=\"②\",管理者設定画面２!AA51,\"\"))","v":"１，０００万円"},null,{"$f":"IF(wkTblNo=\"①\",管理者設定画面２!N51,IF(wkTblNo=\"②\",管理者設定画面２!AC51,\"\"))","v":"ー"}]
[null,null,null,null,null,null,null,null,null,null,null,null,null,null,null,null,null,null,null,null,null,null,null,null,null,null,null,null,null,null,null,null,null,null,null,null,null,null,null,null,null,"現金・貴重品等",null,{"$f":"IF(wkTblNo=\"①\",管理者設定画面２!G52,\"\")","v":"１０万円"},{"$f":"IF(wkTblNo=\"①\",管理者設定画面２!H52,IF(wkTblNo=\"②\",管理者設定画面２!W52,\"\"))","v":"１０万円"},null,{"$f":"IF(wkTblNo=\"①\",管理者設定画面２!J52,IF(wkTblNo=\"②\",管理者設定画面２!Y52,\"\"))","v":"１０万円"},null,{"$f":"IF(wkTblNo=\"①\",管理者設定画面２!L52,IF(wkTblNo=\"②\",管理者設定画面２!AA52,\"\"))","v":"１０万円"},null,{"$f":"IF(wkTblNo=\"①\",管理者設定画面２!N52,IF(wkTblNo=\"②\",管理者設定画面２!AC52,\"\"))","v":"１０万円"}]
[null,null,null,null,null,null,null,null,null,null,null,null,null,null,null,null,null,null,null,null,null,null,null,null,null,null,null,null,null,null,null,null,null,null,null,null,null,null,null,null,null,"上記以外",null,{"$f":"IF(wkTblNo=\"①\",管理者設定画面２!G53,\"\")","v":"１００万円"},{"$f":"IF(wkTblNo=\"①\",管理者設定画面２!H53,IF(wkTblNo=\"②\",管理者設定画面２!W53,\"\"))","v":"１００万円"},null,{"$f":"IF(wkTblNo=\"①\",管理者設定画面２!J53,IF(wkTblNo=\"②\",管理者設定画面２!Y53,\"\"))","v":"１００万円"},null,{"$f":"IF(wkTblNo=\"①\",管理者設定画面２!L53,IF(wkTblNo=\"②\",管理者設定画面２!AA53,\"\"))","v":"１００万円"},null,{"$f":"IF(wkTblNo=\"①\",管理者設定画面２!N53,IF(wkTblNo=\"②\",管理者設定画面２!AC53,\"\"))","v":"１００万円"}]
[]
[null,null,null,null,null,null,null,null,null,null,null,null,null,null,null,null,null,null,null,null,null,null,null,null,null,null,null,null,null,null,null,null,null,null,null,null,null,null,null,"（オプション）クレーム対応費用保険"]
[null,null,null,null,null,null,null,null,null,null,null,null,null,null,null,null,null,null,null,null,null,null,null,null,null,null,null,null,null,null,null,null,null,null,null,null,null,null,null,"ご加入の型",null,"Ｑ",null,null,null,"Ｒ",null,null,null,"Ｓ"]
[null,null,null,null,null,null,null,null,null,null,null,null,null,null,null,null,null,null,null,null,null,null,null,null,null,null,null,null,null,null,null,null,null,null,null,null,null,null,null,"保険金額",null,{"$f":"IF(wkTblNo=\"①\",管理者設定画面２!E57,IF(wkTblNo=\"②\",管理者設定画面２!U57,\"\"))","v":"５０万円（１事故・１期間中）"},null,null,null,{"$f":"IF(wkTblNo=\"①\",管理者設定画面２!I57,IF(wkTblNo=\"②\",管理者設定画面２!Y57,\"\"))","v":"１５０万円（１事故・１期間中）"},null,null,null,{"$f":"IF(wkTblNo=\"①\",管理者設定画面２!M57,IF(wkTblNo=\"②\",管理者設定画面２!AC57,\"\"))","v":"３００万円（１事故・１期間中）"}]
[]
[null,null,null,null,null,null,null,null,null,null,null,null,null,null,null,null,null,null,null,null,null,null,null,null,null,null,null,null,null,null,null,null,null,null,null,null,null,null,null,"プラン６　個人情報漏えい対応保険"]
[null,null,null,null,null,null,null,null,null,null,null,null,null,null,null,null,null,null,null,null,null,null,null,null,null,null,null,null,null,null,null,null,null,null,null,null,null,null,null,"ご加入の型",null,null,null,null,null,null,"Ｉ",null,null,"Ｊ"]
[null,null,null,null,null,null,null,null,null,null,null,null,null,null,null,null,null,null,null,null,null,null,null,null,null,null,null,null,null,null,null,null,null,null,null,null,null,null,null,"第三者の損害賠償に\n関する補償",null,null,null,null,null,null,{"$f":"IF(wkTblNo=\"①\",管理者設定画面２!J61,IF(wkTblNo=\"②\",管理者設定画面２!Z61,\"\"))","v":"５，０００万円"},null,null,{"$f":"IF(wkTblNo=\"①\",管理者設定画面２!M61,IF(wkTblNo=\"②\",管理者設定画面２!AC61,\"\"))","v":"１億円"}]
[]
[null,null,null,null,null,null,null,null,null,null,null,null,null,null,null,null,null,null,null,null,null,null,null,null,null,null,null,null,null,null,null,null,null,null,null,null,null,null,null,"事故に関する各種対応費用",null,null,null,null,null,null,{"$f":"IF(wkTblNo=\"①\",管理者設定画面２!J63,IF(wkTblNo=\"②\",管理者設定画面２!Z63,\"\"))","v":"１００万円"},null,null,{"$f":"IF(wkTblNo=\"①\",管理者設定画面２!M63,IF(wkTblNo=\"②\",管理者設定画面２!AC63,\"\"))","v":"２００万円"}]
[]
[null,null,null,null,null,null,null,null,null,null,null,null,null,null,null,null,null,null,null,null,null,null,null,null,null,null,null,null,null,null,null,null,null,null,null,null,null,null,null,"プラン７　保育業務従事者向け賠償責任保険"]
[null,null,null,null,null,null,null,null,null,null,null,null,null,null,null,null,null,null,null,null,null,null,null,null,null,null,null,null,null,null,null,null,null,null,null,null,null,null,null,"対人・対物賠償",null,null,null,null,null,null,{"$f":"IF(wkTblNo=\"①\",管理者設定画面２!J66,IF(wkTblNo=\"②\",管理者設定画面２!Z66,\"\"))","v":"１億円（１事故あたり）"}]
[null,null,null,null,null,null,null,null,null,null,null,null,null,null,null,null,null,null,null,null,null,null,null,null,null,null,null,null,null,null,null,null,null,null,null,null,null,null,null,"人格権侵害補償"]
[null,null,null,null,null,null,null,null,null,null,null,null,null,null,null,null,null,null,null,null,null,null,null,null,null,null,null,null,null,null,null,null,null,null,null,null,null,null,null,"初期対応費用",null,null,null,null,null,null,{"$f":"IF(wkTblNo=\"①\",管理者設定画面２!J68,IF(wkTblNo=\"②\",管理者設定画面２!Z68,\"\"))","v":"１，０００万円（期間中）"}]
[null,null,null,null,null,null,null,null,null,null,null,null,null,null,null,null,null,null,null,null,null,null,null,null,null,null,null,null,null,null,null,null,null,null,null,null,null,null,null,"争訟対応費用",null,null,null,null,null,null,{"$f":"IF(wkTblNo=\"①\",管理者設定画面２!J69,IF(wkTblNo=\"②\",管理者設定画面２!Z69,\"\"))","v":"５００万円（期間中）"}]
[null,null,null,null,null,null,null,null,null,null,null,null,null,null,null,null,null,null,null,null,null,null,null,null,null,null,null,null,null,null,null,null,null,null,null,null,null,null,null,"お見舞金（被害者対応費用）",null,null,null,null,null,null,{"$f":"IF(wkTblNo=\"①\",管理者設定画面２!J70,IF(wkTblNo=\"②\",管理者設定画面２!Z70,\"\"))","v":"死亡：１００万円\n死亡以外：１０万円\n期間中　５００万円"}]
[]
[null,null,null,null,null,null,null,null,null,null,null,null,null,null,null,null,null,null,null,null,null,null,null,null,null,null,null,null,null,null,null,null,null,null,null,null,null,null,null,"プラン８　雇用関連賠償責任保険"]
[null,null,null,null,null,null,null,null,null,null,null,null,null,null,null,null,null,null,null,null,null,null,null,null,null,null,null,null,null,null,null,null,null,null,null,null,null,null,null,"ご加入の型",null,null,null,null,null,null,"Ｔ",null,null,"Ｕ"]
[null,null,null,null,null,null,null,null,null,null,null,null,null,null,null,null,null,null,null,null,null,null,null,null,null,null,null,null,null,null,null,null,null,null,null,null,null,null,null,"法律上の損害賠償金",null,null,null,"損害賠償金・\n精神的苦痛に対する慰謝料",null,null,{"$f":"IF(wkTblNo=\"①\",管理者設定画面２!J74,IF(wkTblNo=\"②\",管理者設定画面２!Z74,\"\"))","v":"１，０００万円"},null,null,{"$f":"IF(wkTblNo=\"①\",管理者設定画面２!M74,IF(wkTblNo=\"②\",管理者設定画面２!AC74,\"\"))","v":"２，０００万円"}]
[]
[null,null,null,null,null,null,null,null,null,null,null,null,null,null,null,null,null,null,null,null,null,null,null,null,null,null,null,null,null,null,null,null,null,null,null,null,null,null,null,"争訟費用",null,null,null,"弁護士費用・証拠収集のために\n要した費用・文書作成費用"]
[]
[]
[null,null,null,null,null,null,null,null,null,null,null,null,null,null,null,null,null,null,null,null,null,null,null,null,null,null,null,null,null,null,null,null,null,null,null,null,null,null,null,"プラン９　社会福祉法人向け役員賠償責任保険"]
[null,null,null,null,null,null,null,null,null,null,null,null,null,null,null,null,null,null,null,null,null,null,null,null,null,null,null,null,null,null,null,null,null,null,null,null,null,null,null,"ご加入の型",null,null,null,null,null,"Ｎ",null,"Ｏ",null,"Ｐ"]
[null,null,null,null,null,null,null,null,null,null,null,null,null,null,null,null,null,null,null,null,null,null,null,null,null,null,null,null,null,null,null,null,null,null,null,null,null,null,null,"保険金額\n自己負担額なし",null,"役員賠償責任",null,null,null,{"$f":"IF(wkTblNo=\"①\",管理者設定画面２!I81,IF(wkTblNo=\"②\",管理者設定画面２!Y81,\"\"))","v":"５，０００万円"},null,{"$f":"IF(wkTblNo=\"①\",管理者設定画面２!K81,IF(wkTblNo=\"②\",管理者設定画面２!AA81,\"\"))","v":"１億円"},null,{"$f":"IF(wkTblNo=\"①\",管理者設定画面２!M81,IF(wkTblNo=\"②\",管理者設定画面２!AC81,\"\"))","v":"３億円"}]
[null,null,null,null,null,null,null,null,null,null,null,null,null,null,null,null,null,null,null,null,null,null,null,null,null,null,null,null,null,null,null,null,null,null,null,null,null,null,null,null,null,"法人調査費用（法人内調査費用）",null,null,null,{"$f":"IF(wkTblNo=\"①\",管理者設定画面２!I82,IF(wkTblNo=\"②\",管理者設定画面２!Y82,\"\"))","v":"１，０００万円"},null,{"$f":"IF(wkTblNo=\"①\",管理者設定画面２!K82,IF(wkTblNo=\"②\",管理者設定画面２!AA82,\"\"))","v":"１，０００万円"},null,{"$f":"IF(wkTblNo=\"①\",管理者設定画面２!M82,IF(wkTblNo=\"②\",管理者設定画面２!AC82,\"\"))","v":"１，０００万円"}]
[null,null,null,null,null,null,null,null,null,null,null,null,null,null,null,null,null,null,null,null,null,null,null,null,null,null,null,null,null,null,null,null,null,null,null,null,null,null,null,null,null,"法人調査費用（第三者委員会対応費用）",null,null,null,{"$f":"IF(wkTblNo=\"①\",管理者設定画面２!I83,IF(wkTblNo=\"②\",管理者設定画面２!Y83,\"\"))","v":"５，０００万円"},null,{"$f":"IF(wkTblNo=\"①\",管理者設定画面２!K83,IF(wkTblNo=\"②\",管理者設定画面２!AA83,\"\"))","v":"５，０００万円"},null,{"$f":"IF(wkTblNo=\"①\",管理者設定画面２!M83,IF(wkTblNo=\"②\",管理者設定画面２!AC83,\"\"))","v":"５，０００万円"}]
[]
[null,null,null,null,null,null,null,null,null,null,null,null,null,null,null,null,null,null,null,null,null,null,null,null,null,null,null,null,null,null,null,null,null,null,null,null,null,null,null,"プラン１０　保育園動産（什器・備品）補償保険"]
[null,null,null,null,null,null,null,null,null,null,null,null,null,null,null,null,null,null,null,null,null,null,null,null,null,null,null,null,null,null,null,null,null,null,null,null,null,null,null,"ご加入の型",null,null,null,null,"Ｍ","Ｋ","Ｌ","ＭＥ","ＫＥ","ＬＥ"]
[null,null,null,null,null,null,null,null,null,null,null,null,null,null,null,null,null,null,null,null,null,null,null,null,null,null,null,null,null,null,null,null,null,null,null,null,null,null,null,"保険金額",null,"地震等以外（１事故）",null,null,{"$f":"IF(wkTblNo=\"①\",管理者設定画面２!H87,IF(wkTblNo=\"②\",管理者設定画面２!X87,\"\"))","v":"５０万円"},{"$f":"IF(wkTblNo=\"①\",管理者設定画面２!I87,IF(wkTblNo=\"②\",管理者設定画面２!Y87,\"\"))","v":"１００万円"},{"$f":"IF(wkTblNo=\"①\",管理者設定画面２!J87,IF(wkTblNo=\"②\",管理者設定画面２!Z87,\"\"))","v":"３００万円"},{"$f":"IF(wkTblNo=\"①\",管理者設定画面２!K87,IF(wkTblNo=\"②\",管理者設定画面２!AA87,\"\"))","v":"５０万円"},{"$f":"IF(wkTblNo=\"①\",管理者設定画面２!L87,IF(wkTblNo=\"②\",管理者設定画面２!AB87,\"\"))","v":"１００万円"},{"$f":"IF(wkTblNo=\"①\",管理者設定画面２!M87,IF(wkTblNo=\"②\",管理者設定画面２!AC87,\"\"))","v":"３００万円"}]
[null,null,null,null,null,null,null,null,null,null,null,null,null,null,null,null,null,null,null,null,null,null,null,null,null,null,null,null,null,null,null,null,null,null,null,null,null,null,null,null,null,"地震等（保険期間中）",null,null,{"$f":"IF(wkTblNo=\"①\",管理者設定画面２!H88,IF(wkTblNo=\"②\",管理者設定画面２!X88,\"\"))","v":"×"},{"$f":"IF(wkTblNo=\"①\",管理者設定画面２!I88,IF(wkTblNo=\"②\",管理者設定画面２!Y88,\"\"))","v":"×"},{"$f":"IF(wkTblNo=\"①\",管理者設定画面２!J88,IF(wkTblNo=\"②\",管理者設定画面２!Z88,\"\"))","v":"×"},{"$f":"IF(wkTblNo=\"①\",管理者設定画面２!K88,IF(wkTblNo=\"②\",管理者設定画面２!AA88,\"\"))","v":"５０万円"},{"$f":"IF(wkTblNo=\"①\",管理者設定画面２!L88,IF(wkTblNo=\"②\",管理者設定画面２!AB88,\"\"))","v":"１００万円"},{"$f":"IF(wkTblNo=\"①\",管理者設定画面２!M88,IF(wkTblNo=\"②\",管理者設定画面２!AC88,\"\"))","v":"３００万円"}]

{"sheet":"人数入力画面","index":4,"n_rows":26,"n_cols":56,"rows_kept":26,"cut":false,"hidden":true,"merged":[[22,42,24,49],[22,50,24,52],[22,53,24,54],[0,8,1,32],[19,0,19,6],[20,0,20,6],[17,0,17,6],[15,32,15,35],[13,32,13,35],[11,32,11,35],[9,32,9,35],[7,17,7,26],[7,27,8,31],[7,32,8,36],[8,17,8,21],[8,22,8,26],[19,27,19,30],[14,0,14,6],[13,17,13,20],[13,22,13,25],[13,0,13,6],[12,14,12,15],[12,17,12,20],[12,22,12,25],[9,22,9,25],[9,27,9,30],[12,9,12,10],[5,42,6,49],[5,50,6,53],[5,54,6,54],[9,42,10,49],[9,50,10,53],[9,54,10,54],[5,12,5,16],[5,9,5,11],[25,27,25,30],[25,32,25,35],[21,9,21,16],[21,17,21,20],[21,22,21,25],[13,42,14,49],[13,50,14,53],[13,54,14,54],[18,42,19,49],[18,50,19,53],[18,54,19,54],[13,9,13,10],[13,11,13,12],[13,14,13,15],[13,27,13,30],[21,27,21,30],[21,32,21,35],[25,9,25,16],[25,17,25,20],[25,22,25,25],[19,32,19,35],[20,9,20,10],[20,11,20,12],[20,14,20,15],[20,17,20,20],[20,22,20,25],[20,27,20,30],[20,32,20,35],[19,9,19,10],[19,11,19,12],[19,14,19,15],[19,17,19,20],[19,22,19,25],[18,32,18,35],[16,9,16,10],[16,11,16,12],[16,14,16,15],[16,17,16,20],[16,22,16,25],[16,27,16,30],[16,32,16,35],[14,9,14,10],[14,11,14,12],[14,14,14,15],[14,17,14,20],[14,22,14,25],[14,27,14,30],[14,32,14,35],[17,32,17,35],[15,9,15,10],[15,11,15,12],[15,14,15,15],[15,17,15,20],[15,22,15,25],[15,27,15,30],[18,0,18,6],[17,9,17,10],[17,11,17,12],[17,14,17,15],[17,17,17,20],[17,22,17,25],[17,27,17,30],[15,0,15,6],[18,9,18,10],[18,11,18,12],[18,14,18,15],[18,17,18,20],[18,22,18,25],[18,27,18,30],[16,0,16,6],[12,0,12,6],[11,17,11,20],[11,22,11,25],[11,27,11,30],[12,32,12,35],[11,9,11,10],[11,11,11,12],[11,14,11,15],[9,0,9,6],[10,0,10,6],[9,9,9,10],[9,11,9,12],[9,14,9,15],[9,17,9,20],[11,0,11,6],[10,9,10,10],[10,11,10,12],[10,14,10,15],[10,17,10,20],[10,22,10,25],[10,27,10,30],[10,32,10,35],[12,11,12,12],[12,27,12,30]]}
[null,null,null,null,null,null,null,null,"STEP２＜　人数入力　＞　各プランに応じた人数を入力してください。"]
[]
[]
[]
[null,null,null,null,null,null,null,null,null,"★実績計算書　プラン１、プラン５、オプション、プラン６、プラン１０に加入する場合に入力",null,null,null,null,null,null,null,null,null,null,null,null,null,null,null,null,null,null,null,null,null,null,null,null,null,null,null,null,null,null,null,null,"★プラン２に加入する場合に入力"]
[null,null,null,null,null,null,null,null,null,"加入月",null,null,null,null,null,null,null,null,null,null,"新設のため前年実績なし（平均在籍者数に直接入力）",null,null,null,null,null,null,null,null,null,null,null,null,null,null,null,null,null,null,null,null,null,"各行事の延参加者数",null,null,null,null,null,null,null,null,null,null,null,"人"]
[]
[null,null,null,null,null,null,null,null,null,null,null,null,null,null,null,null,null,"園児数",null,null,null,null,null,null,null,null,null,"学童数",null,null,null,null,"職員数"]
[null,null,null,null,null,null,null,null,null,null,null,null,null,null,null,null,null,"通常保育",null,null,null,null,"一時保育等(※)",null,null,null,null,null,null,null,null,null,null,null,null,null,null,null,null,null,null,null,"★プラン３に加入する場合に入力"]
[{"$f":"IF($M$6=\"\",\"\",EDATE($M$6,-13))","v":""},null,null,null,null,null,null,null,null,{"$f":"TEXT(A10,\"ggg\")","v":""},null,{"$f":"TEXT(A10,\"e\")","v":""},null,"年",{"$f":"TEXT(A10,\"m\")","v":""},null,"月",null,null,null,null,"人",null,null,null,null,"人",null,null,null,null,"人",null,null,null,null,"人",null,null,null,null,null,"法定乗車定員数\nの合計",null,null,null,null,null,null,null,null,null,null,null,"人"]
[{"$f":"IF($M$6=\"\",\"\",EDATE($M$6,-12))","v":""},null,null,null,null,null,null,null,null,"",null,"",null,"年","",null,"月",null,null,null,null,"人",null,null,null,null,"人",null,null,null,null,"人",null,null,null,null,"人"]
[{"$f":"IF($M$6=\"\",\"\",EDATE($M$6,-11))","v":""},null,null,null,null,null,null,null,null,"",null,"",null,"年","",null,"月",null,null,null,null,"人",null,null,null,null,"人",null,null,null,null,"人",null,null,null,null,"人"]
[{"$f":"IF($M$6=\"\",\"\",EDATE($M$6,-10))","v":""},null,null,null,null,null,null,null,null,"",null,"",null,"年","",null,"月",null,null,null,null,"人",null,null,null,null,"人",null,null,null,null,"人",null,null,null,null,"人",null,null,null,null,null,"★プラン４に加入する場合に入力"]
[{"$f":"IF($M$6=\"\",\"\",EDATE($M$6,-9))","v":""},null,null,null,null,null,null,null,null,"",null,"",null,"年","",null,"月",null,null,null,null,"人",null,null,null,null,"人",null,null,null,null,"人",null,null,null,null,"人",null,null,null,null,null,"直近会計年度の\n平均被用者数",null,null,null,null,null,null,null,null,null,null,null,"人"]
[{"$f":"IF($M$6=\"\",\"\",EDATE($M$6,-8))","v":""},null,null,null,null,null,null,null,null,"",null,"",null,"年","",null,"月",null,null,null,null,"人",null,null,null,null,"人",null,null,null,null,"人",null,null,null,null,"人"]
[{"$f":"IF($M$6=\"\",\"\",EDATE($M$6,-7))","v":""},null,null,null,null,null,null,null,null,"",null,"",null,"年","",null,"月",null,null,null,null,"人",null,null,null,null,"人",null,null,null,null,"人",null,null,null,null,"人",null,null,null,null,null,"法定外補償規定の備え付けはありますか？",null,null,null,null,null,null,null,null,null,null,"あり",null,"なし"]
[{"$f":"IF($M$6=\"\",\"\",EDATE($M$6,-6))","v":""},null,null,null,null,null,null,null,null,"",null,"",null,"年","",null,"月",null,null,null,null,"人",null,null,null,null,"人",null,null,null,null,"人",null,null,null,null,"人"]
[{"$f":"IF($M$6=\"\",\"\",EDATE($M$6,-5))","v":""},null,null,null,null,null,null,null,null,"",null,"",null,"年","",null,"月",null,null,null,null,"人",null,null,null,null,"人",null,null,null,null,"人",null,null,null,null,"人",null,null,null,null,null,"★プラン７に加入する場合に入力"]
[{"$f":"IF($M$6=\"\",\"\",EDATE($M$6,-4))","v":""},null,null,null,null,null,null,null,null,"",null,"",null,"年","",null,"月",null,null,null,null,"人",null,null,null,null,"人",null,null,null,null,"人",null,null,null,null,"人",null,null,null,null,null,"加入月の前々月末時点\n職員人数の合計",null,null,null,null,null,null,null,null,null,null,null,"人"]
[{"$f":"IF($M$6=\"\",\"\",EDATE($M$6,-3))","v":""},null,null,null,null,null,null,null,null,"",null,"",null,"年","",null,"月",null,null,null,null,"人",null,null,null,null,"人",null,null,null,null,"人",null,null,null,null,"人"]
[{"$f":"IF($M$6=\"\",\"\",EDATE($M$6,-2))","v":""},null,null,null,null,null,null,null,null,"",null,"",null,"年","",null,"月",null,null,null,null,"人",null,null,null,null,"人",null,null,null,null,"人",null,null,null,null,"人"]
[null,null,null,null,null,null,null,null,null,"合　計",null,null,null,null,null,null,null,{"$f":"SUM(R10:U21)","v":0},null,null,null,"人",{"$f":"SUM(W10:Z21)","v":0},null,null,null,"人",{"$f":"SUM(AB10:AE21)","v":0},null,null,null,"人",{"$f":"SUM(AG10:AJ21)","v":0},null,null,null,"人",null,null,null,null,null,"★プラン８、プラン９に加入する場合に入力"]
[null,null,null,null,null,null,null,null,null,"(※)月間の延べ園児数÷その月の実施日数(小数点以下四捨五入)で算出してください。",null,null,null,null,null,null,null,null,null,null,null,null,null,null,null,null,null,null,null,null,null,null,null,null,null,null,null,null,null,null,null,null,"法人全体(日本国内)の\n直近会計年度の\n全事業収入の合計金額",null,null,null,null,null,null,null,null,null,null,"億円"]
[]
[]
[null,null,null,null,null,null,null,null,null,"平均在籍者数\n(小数点第一位四捨五入)",null,null,null,null,null,null,null,{"$f":"ROUND(R22/12,0)","v":0},null,null,null,"人",{"$f":"ROUND(W22/12,0)","v":0},null,null,null,"人",{"$f":"ROUND(AB22/12,0)","v":0},null,null,null,"人",{"$f":"ROUND(AG22/12,0)","v":0},null,null,null,"人"]

{"sheet":"加入者・保険会社情報入力画面","index":5,"n_rows":49,"n_cols":38,"rows_kept":49,"cut":false,"hidden":true,"merged":[[0,1,1,19],[48,10,48,14],[48,6,48,9],[40,20,41,20],[36,2,36,3],[36,4,36,20],[32,2,32,3],[32,4,32,20],[28,2,28,3],[28,4,28,20],[18,10,18,11],[18,13,18,14],[18,17,18,20],[8,2,8,5],[8,6,8,27],[7,2,7,5],[36,21,36,29],[40,12,41,19],[34,2,34,3],[34,4,34,20],[34,21,34,29],[35,2,35,3],[35,4,35,20],[35,21,35,29],[32,21,32,29],[33,2,33,3],[33,4,33,20],[33,21,33,29],[30,2,30,3],[30,4,30,20],[30,21,30,29],[31,2,31,3],[31,4,31,20],[31,21,31,29],[28,21,28,29],[29,2,29,3],[29,4,29,20],[29,21,29,29],[22,2,22,5],[22,6,22,15],[22,17,22,20],[22,21,22,24],[24,2,24,5],[24,6,24,15],[24,17,24,20],[24,21,24,30],[20,6,20,9],[10,2,10,5],[10,6,10,27],[11,2,11,5],[11,6,11,27],[13,2,13,5],[13,6,13,27],[14,2,14,5],[14,6,14,27],[20,2,20,5],[20,17,20,20],[20,21,20,24],[18,2,18,5],[18,6,18,8],[18,25,18,26],[7,6,7,27],[5,20,5,22],[5,24,5,26],[18,21,18,23],[5,2,5,5],[5,6,5,8],[5,10,5,12],[5,14,5,15],[5,16,5,18],[24,31,24,34],[24,35,24,44],[5,28,5,29],[5,30,5,32],[5,34,5,36],[18,28,18,29],[18,32,18,35],[18,36,18,39],[5,38,5,40]]}
[null,"STEP３＜　加入者・保険会社情報入力　＞"]
[]
[]
[null,null,"日本保育協会の会員であることを確認し、下記内容で保険に加入します。",null,null,null,null,null,null,null,null,null,null,null,null,null,null,null,null,null,null,null,null,null,null,null,null,"はい",null,null,null,"いいえ"]
[null,null,"★加入者情報"]
[null,null,"郵便番号",null,null,null,null,null,null,"－",null,null,null,null,"TEL",null,null,null,null,"－",null,null,null,"－",null,null,null,null,"FAX",null,null,null,null,"－",null,null,null,"－"]
[null,null,null,null,null,null,"※フリガナは自動反映します。誤っている場合は修正してください。(50文字超は反映されません。)"]
[null,null,"フリガナ"]
[null,null,"住所"]
[null,null,null,null,null,null,"※フリガナは自動反映します。誤っている場合は修正してください。(66文字超は反映されません。)"]
[null,null,"フリガナ"]
[null,null,"保育園名",null,null,null,null,null,null,null,null,null,null,null,null,null,null,null,null,null,null,null,null,null,null,null,null,null,null,"分園含む"]
[null,null,null,null,null,null,"※フリガナは自動反映します。誤っている場合は修正してください。(50文字超は反映されません。)"]
[null,null,"フリガナ"]
[null,null,"法人名"]
[]
[]
[null,null,"★保険会社・代理店入力欄",null,null,null,null,null,null,null,null,null,null,null,null,null,null,null,null,null,null,null,null,null,null,null,null,null,null,null,null,null,"継続加入の場合に入力"]
[null,null,"保険始期",null,null,null,null,null,null,"年",null,null,"月",1,null,"日",null,"保険終期",null,null,null,{"$f":"IF(G19=\"\",\"\",G19+1)","v":""},null,null,"年",{"$f":"IF(K19=\"\",\"\",K19)","v":""},null,"月",1,null,"日",null,"加入者番号",null,null,null,""]
[]
[null,null,"部担コード",null,null,null,null,null,null,null,null,null,null,null,null,null,null,"代理店コード"]
[]
[null,null,"部店名",null,null,null,null,null,null,null,null,null,null,null,null,null,null,"サブコード"]
[null,null,null,null,null,null,null,null,null,null,null,null,null,null,null,null,null,null,null,null,null,null,null,null,null,null,null,null,null,null,null,null,null,null,null,"※フリガナは自動反映します。誤っている場合は修正してください。(15文字超は反映されません。)"]
[null,null,"担当店名",null,null,null,null,null,null,null,null,null,null,null,null,null,null,"代理店名",null,null,null,null,null,null,null,null,null,null,null,null,null,"フリガナ"]
[]
[]
[null,null,"★自動車明細書　プラン３にご加入する場合に入力"]
[null,null,"No",null,"自動車登録番号",null,null,null,null,null,null,null,null,null,null,null,null,null,null,null,null,"法定乗車定員数"]
[null,null,"例",null,"品川　22　あ　〇〇〇〇",null,null,null,null,null,null,null,null,null,null,null,null,null,null,null,null,20]
[null,null,"①"]
[null,null,"②"]
[null,null,"③"]
[null,null,"④"]
[null,null,"⑤"]
[null,null,"⑥"]
[null,null,null,null,"合　　　　　計　　",null,null,null,null,null,null,null,null,null,null,null,null,null,null,null,null,{"$f":"SUM(V31:AD36)","v":0}]
[]
[]
[]
[null,null,null,null,null,null,null,null,null,null,null,null,null,null,null,null,null,null,null,null,"円"]
[]
[]
[null,null,null,null,null,null,null,null,null,null,null,null,null,null,null,null,null,null,"※必ず両面印刷をお願いします"]
[]
[]
[]
[]
[null,null,null,null,null,null,"見積書作成日",null,null,null,"2024-12-10"]

{"sheet":"加入依頼書","index":6,"n_rows":0,"n_cols":0,"rows_kept":0,"cut":false,"hidden":true,"merged":[]}

{"sheet":"告知書","index":7,"n_rows":0,"n_cols":0,"rows_kept":0,"cut":false,"hidden":true,"merged":[]}

{"sheet":"見積書","index":8,"n_rows":65,"n_cols":46,"rows_kept":65,"cut":false,"hidden":true,"merged":[[54,26,56,28],[54,29,56,32],[54,33,56,33],[54,34,56,37],[54,38,56,38],[54,39,56,44],[54,45,56,45],[15,0,16,3],[15,4,16,23],[15,26,16,29],[15,30,16,45],[18,0,18,2],[18,3,18,6],[18,7,18,11],[18,12,18,16],[18,17,18,23],[18,26,18,28],[18,29,18,33],[18,34,18,38],[18,39,18,45],[19,39,21,44],[19,45,21,45],[24,0,25,3],[24,4,25,23],[24,26,25,29],[24,30,25,45],[19,16,21,16],[19,17,21,22],[19,23,21,23],[19,26,21,28],[19,29,21,32],[19,33,21,33],[19,0,21,2],[19,6,21,6],[19,7,21,10],[19,11,21,11],[19,12,21,15],[19,34,21,37],[19,38,21,38],[19,3,21,5],[27,29,27,33],[27,34,27,38],[27,39,27,45],[28,0,30,2],[28,6,30,6],[28,7,30,10],[28,11,30,11],[28,12,30,15],[27,0,27,2],[27,3,27,6],[27,7,27,11],[27,12,27,16],[27,17,27,23],[27,26,27,28],[28,34,30,37],[28,38,30,38],[28,39,30,44],[28,45,30,45],[28,3,30,5],[33,0,34,3],[33,4,34,23],[33,26,34,29],[33,30,34,45],[28,16,30,16],[28,17,30,22],[28,23,30,23],[28,26,30,28],[28,29,30,32],[28,33,30,33],[31,26,31,45],[36,29,36,33],[36,34,36,38],[36,39,36,45],[37,0,39,2],[37,3,39,5],[37,6,39,6],[37,7,39,10],[37,11,39,11],[37,12,39,15],[37,16,39,16],[36,0,36,2],[36,3,36,6],[36,7,36,11],[36,12,36,16],[36,17,36,23],[36,26,36,28],[37,38,39,38],[37,39,39,44],[37,45,39,45],[41,0,42,3],[41,4,42,23],[41,26,42,29],[41,30,42,45],[37,17,39,22],[37,23,39,23],[37,26,39,28],[37,29,39,32],[37,33,39,33],[37,34,39,37],[44,29,44,33],[44,34,44,38],[44,39,44,45],[45,0,47,2],[45,3,47,5],[45,6,47,6],[45,7,47,10],[45,11,47,11],[45,12,47,15],[45,16,47,16],[44,0,44,2],[44,3,44,6],[44,7,44,11],[44,12,44,16],[44,17,44,23],[44,26,44,28],[45,39,47,44],[45,45,47,45],[45,26,47,28],[45,29,47,32],[45,33,47,33],[45,34,47,37],[60,8,60,12],[60,13,60,19],[54,0,56,2],[54,3,56,5],[54,6,56,6],[54,7,56,10],[54,11,56,11],[54,12,56,15],[45,38,47,38],[50,0,51,3],[50,4,51,23],[53,0,53,2],[53,3,53,6],[53,7,53,11],[53,12,53,16],[53,17,53,23],[45,17,47,22],[45,23,47,23],[50,26,51,29],[50,30,51,45],[53,26,53,28],[53,29,53,33],[53,34,53,38],[53,39,53,45],[13,6,13,13],[13,16,13,23],[1,37,1,44],[2,1,2,15],[3,35,3,44],[4,35,4,44],[6,0,6,45],[60,26,63,34],[60,35,63,43],[60,44,63,45],[61,0,63,2],[61,3,63,6],[61,7,63,7],[61,8,63,11],[61,12,63,12],[61,13,63,18],[61,19,63,19],[54,16,56,16],[54,17,56,22],[54,23,56,23],[58,0,58,3],[58,4,58,23],[60,0,60,2],[60,3,60,7]]}
[]
[null,null,null,null,null,null,null,null,null,null,null,null,null,null,null,null,null,null,null,null,null,null,null,null,null,null,null,null,null,null,null,null,null,null,null,null,null,{"$f":"IF(加入者・保険会社情報入力画面!K49=\"\",\"\",加入者・保険会社情報入力画面!K49)","v":"2024-12-10"}]
[null,{"$f":"IF(加入者・保険会社情報入力画面!G15=\"\",\"\",加入者・保険会社情報入力画面!G15)","v":""},null,null,null,null,null,null,null,null,null,null,null,null,null,null,"御中"]
[null,null,null,null,null,null,null,null,null,null,null,null,null,null,null,null,null,null,null,null,null,null,null,null,null,null,null,null,null,null,null,null,null,"取扱代理店",null,{"$f":"IF(加入者・保険会社情報入力画面!V25=\"\",\"\",加入者・保険会社情報入力画面!V25)","v":""}]
[null,null,null,null,null,null,null,null,null,null,null,null,null,null,null,null,null,null,null,null,null,null,null,null,null,null,null,null,null,null,null,null,null,"引受保険会社",null,"損害保険ジャパン株式会社"]
[]
["【日本保育協会　保育園総合保険制度】お見積り"]
[]
[null,"拝啓　時下ますますご清栄のこととお喜び申し上げます。平素は格別のご高配を賜り、厚く御礼申し上げます。"]
[null,"さて、保育園総合保険制度の保険料につきまして以下のとおりお見積りいたしましたので、ご案内させていただきます。"]
[null,"　お手元のパンフレットとあわせてご高覧、ご検討の上、何卒ご用命賜りますようよろしくお願い申し上げます。"]
[null,null,null,null,null,null,null,null,null,null,null,null,null,null,null,null,null,null,null,null,null,null,null,null,null,null,null,null,null,null,null,null,null,null,null,null,null,null,null,null,null,null,null,null,"敬具"]
[null,"基本情報"]
[null,null,"保険期間",null,null,null,{"$f":"IF(OR(加入者・保険会社情報入力画面!G19=\"\",加入者・保険会社情報入力画面!K19=\"\"),\"\",DATE(加入者・保険会社情報入力画面!G19,加入者・保険会社情報入力画面!K19,加入者・保険会社情報入力画面!N19))","v":""},null,null,null,null,null,null,null,"から",null,{"$f":"IF(OR(加入者・保険会社情報入力画面!G19=\"\",加入者・保険会社情報入力画面!K19=\"\"),\"\",DATE(加入者・保険会社情報入力画面!V19,加入者・保険会社情報入力画面!Z19,加入者・保険会社情報入力画面!AC19))","v":""},null,null,null,null,null,null,null,"まで",null,null,"1年間"]
[null,"補償内容"]
["プラン１",null,null,null,"保育園児等傷害保険",null,null,null,null,null,null,null,null,null,null,null,null,null,null,null,null,null,null,null,null,null,"プラン６",null,null,null,"個人情報漏えい対応保険"]
[]
[]
["加入有無",null,null,"ご加入の型",null,null,null,"1名あたり保険料",null,null,null,null,"平均園児数(職員数)",null,null,null,null,"年間保険料",null,null,null,null,null,null,null,null,"加入有無",null,null,"ご加入の型",null,null,null,null,"平均園児数",null,null,null,null,"年間保険料"]
[{"$f":"IF(wkPlan1=1,\"○\",\"×\")","v":"×"},null,null,{"$f":"IF(A20=\"○\",WK!X2,\"\")","v":""},null,null,"型",{"$f":"IF(A20=\"○\",IF(wkTblNo=\"①\",VLOOKUP(D20,vlook_plan1,2,FALSE),IF(wkTblNo=\"②\",VLOOKUP(D20,vlook_plan1,3,FALSE),\"\")),\"\")","v":""},null,null,null,"円",{"$f":"IF(A20=\"○\",人数入力画面!R26+人数入力画面!W26+人数入力画面!AB26+人数入力画面!AG26,\"\")","v":""},null,null,null,"人",{"$f":"IF(A20=\"○\",H20*M20,\"\")","v":""},null,null,null,null,null,"円",null,null,{"$f":"IF(wkPlan6=1,\"○\",\"×\")","v":"×"},null,null,{"$f":"IF(AA20=\"○\",WK!X8,\"\")","v":""},null,null,null,"型",{"$f":"IF(AA20=\"○\",人数入力画面!R26+人数入力画面!W26+人数入力画面!AB26,\"\")","v":""},null,null,null,"人",{"$f":"IF(AA20=\"○\",VLOOKUP(AI20,vlook_plan6,保険料計算用!AC11,TRUE),\"\")","v":""},null,null,null,null,null,"円"]
[]
[]
[null,{"$f":"+IF($D$36=\"A\",\"※このプランではケガによる傷害のほか、細菌性食中毒および天災によるケガも補償の対象になります。\",IF($D$36=\"C\",\"※このプランでは、ケガによる傷害のほか、細菌性食中毒によるケガも補償の対象となります。\",IF($D$36=\"B\",\"※このプランでは、怪我による傷害が補償の対象となります。\",\"\")))","v":""}]
[]
["プラン２",null,null,null,"主催行事参加者傷害保険",null,null,null,null,null,null,null,null,null,null,null,null,null,null,null,null,null,null,null,null,null,"プラン７",null,null,null,"保育業務従事者向け賠償責任保険"]
[]
[]
["加入有無",null,null,"ご加入の型",null,null,null,"1名あたり保険料",null,null,null,null,"延べ参加者数",null,null,null,null,"年間保険料",null,null,null,null,null,null,null,null,"加入有無",null,null,"1名あたり掛金",null,null,null,null,"職員数※",null,null,null,null,"掛金"]
[{"$f":"IF(wkPlan2=1,\"○\",\"×\")","v":"×"},null,null,{"$f":"IF(A29=\"○\",WK!X3,\"\")","v":""},null,null,"型",{"$f":"IF(A29=\"○\",IF(wkTblNo=\"①\",VLOOKUP(D29,vlook_plan2,2,FALSE),IF(wkTblNo=\"②\",VLOOKUP(D29,vlook_plan2,3,FALSE),\"\")),\"\")","v":""},null,null,null,"円",{"$f":"IF(A29=\"○\",人数入力画面!AY6,\"\")","v":""},null,null,null,"人",{"$f":"IF(A29=\"○\",H29*M29,\"\")","v":""},null,null,null,null,null,"円",null,null,{"$f":"IF(wkPlan7=1,\"○\",\"×\")","v":"×"},null,null,{"$f":"IF(AA29=\"○\",IF(wkTblNo=\"①\",管理者設定画面１!C31,IF(wkTblNo=\"②\",管理者設定画面１!AQ31,\"\")),\"\")","v":""},null,null,null,"円",{"$f":"IF(AA29=\"○\",人数入力画面!AY19,\"\")","v":""},null,null,null,"人",{"$f":"IF(AA29=\"○\",AD29*AI29,\"\")","v":""},null,null,null,null,null,"円"]
[]
[]
["※プラン２はプラン１とのセット加入となります。プラン２単独でのご加入はできません。",null,null,null,null,null,null,null,null,null,null,null,null,null,null,null,null,null,null,null,null,null,null,null,null,null,"※職員数は保育士・職員・事務員などの保育園に勤務する全職員（パート・アルバイトを含む）になります。"]
[]
["プラン３",null,null,null,"自動車搭乗中傷害保険",null,null,null,null,null,null,null,null,null,null,null,null,null,null,null,null,null,null,null,null,null,"プラン８",null,null,null,"雇用関連賠償責任保険"]
[]
[]
["加入有無",null,null,"車両台数",null,null,null,"1名あたり保険料",null,null,null,null,"法定乗車員数計",null,null,null,null,"年間保険料",null,null,null,null,null,null,null,null,"加入有無",null,null,"ご加入の型",null,null,null,null,"総収入金額",null,null,null,null,"年間保険料"]
[{"$f":"IF(wkPlan3=1,\"○\",\"×\")","v":"×"},null,null,{"$f":"IF(A38=\"○\",COUNTA(加入者・保険会社情報入力画面!E31:U36),\"\")","v":""},null,null,"台",{"$f":"IF(A38=\"○\",IF(wkTblNo=\"①\",管理者設定画面１!C18,IF(wkTblNo=\"②\",管理者設定画面１!AQ18,\"\")),\"\")","v":""},null,null,null,"円",{"$f":"IF(A38=\"○\",人数入力画面!AY10,\"\")","v":""},null,null,null,"人",{"$f":"IF(A38=\"○\",H38*M38,\"\")","v":""},null,null,null,null,null,"円",null,null,{"$f":"IF(wkPlan8=1,\"○\",\"×\")","v":"×"},null,null,{"$f":"IF(AA38=\"○\",WK!X10,\"\")","v":""},null,null,null,"型",{"$f":"IF(AA38=\"○\",人数入力画面!AY23,\"\")","v":""},null,null,null,"億",{"$f":"IF(AA38=\"○\",VLOOKUP(AI38,vlook_plan8,保険料計算用!AJ12,TRUE),\"\")","v":""},null,null,null,null,null,"円"]
[]
[]
[]
["プラン４",null,null,null,"保育園職員労災上乗せ保険",null,null,null,null,null,null,null,null,null,null,null,null,null,null,null,null,null,null,null,null,null,"プラン９",null,null,null,"社会福祉法人向け役員賠償責任保険"]
[]
[]
["加入有無",null,null,"ご加入の型",null,null,null,"1名あたり保険料",null,null,null,null,"平均職員数※",null,null,null,null,"年間保険料",null,null,null,null,null,null,null,null,"加入有無",null,null,"ご加入の型",null,null,null,null,"総収入金額",null,null,null,null,"年間保険料"]
[{"$f":"IF(wkPlan4=1,\"○\",\"×\")","v":"×"},null,null,{"$f":"IF(A46=\"○\",WK!X5,\"\")","v":""},null,null,"型",{"$f":"IF(A46=\"○\",IF(wkTblNo=\"①\",VLOOKUP(D46,vlook_plan4,2,FALSE),IF(wkTblNo=\"②\",VLOOKUP(D46,vlook_plan4,3,FALSE),\"\")),\"\")","v":""},null,null,null,"円",{"$f":"IF(A46=\"○\",人数入力画面!AY14,\"\")","v":""},null,null,null,"人",{"$f":"IF(A46=\"○\",H46*M46,\"\")","v":""},null,null,null,null,null,"円",null,null,{"$f":"IF(wkPlan9=1,\"○\",\"×\")","v":"×"},null,null,{"$f":"IF(AA46=\"○\",WK!X11,\"\")","v":""},null,null,null,"型",{"$f":"IF(AA46=\"○\",人数入力画面!AY23,\"\")","v":""},null,null,null,"億",{"$f":"IF(AA46=\"○\",VLOOKUP(AI46,vlook_plan9,保険料計算用!AQ11,TRUE),\"\")","v":""},null,null,null,null,null,"円"]
[]
[]
["※平均職員数は政府労災資料記載の平均被雇者数になります。"]
[]
["プラン５",null,null,null,"保育園賠償責任保険",null,null,null,null,null,null,null,null,null,null,null,null,null,null,null,null,null,null,null,null,null,"プラン１０",null,null,null,"保育園動産（什器・備品）補償保険"]
[]
[]
["加入有無",null,null,"ご加入の型",null,null,null,"1名あたり保険料",null,null,null,null,"平均園児数",null,null,null,null,"年間保険料",null,null,null,null,null,null,null,null,"加入有無",null,null,"ご加入の型",null,null,null,null,"平均園児数",null,null,null,null,"年間保険料"]
[{"$f":"IF(wkPlan5=1,\"○\",\"×\")","v":"×"},null,null,{"$f":"IF(A55=\"○\",WK!X6,\"\")","v":""},null,null,"型",{"$f":"IF(A55=\"○\",IF(wkTblNo=\"①\",VLOOKUP(D55,vlook_plan5,2,FALSE),IF(wkTblNo=\"②\",VLOOKUP(D55,vlook_plan5,3,FALSE),\"\")),\"\")","v":""},null,null,null,"円",{"$f":"IF(A55=\"○\",人数入力画面!R26+人数入力画面!W26+人数入力画面!AB26,\"\")","v":""},null,null,null,"人",{"$f":"IF(A55=\"○\",H55*M55,\"\")","v":""},null,null,null,null,null,"円",null,null,{"$f":"IF(wkPlan10=1,\"○\",\"×\")","v":"×"},null,null,{"$f":"IF(AA55=\"○\",WK!X12,\"\")","v":""},null,null,null,"型",{"$f":"IF(AA55=\"○\",人数入力画面!R26+人数入力画面!W26+人数入力画面!AB26,\"\")","v":""},null,null,null,"人",{"$f":"IF(AA55=\"○\",VLOOKUP(AI55,vlook_plan10,保険料計算用!AZ11,TRUE),\"\")","v":""},null,null,null,null,null,"円"]
[]
[]
[]
["オプション",null,null,null,"クレーム対応費用保険"]
[]
["加入有無",null,null,"ご加入の型",null,null,null,null,"平均園児数",null,null,null,null,"年間保険料",null,null,null,null,null,null,null,null,null,null,null,null,"年間掛金",null,null,null,null,null,null,null,null,{"$f":"SUM(R20,R29,R38,R46,R55,N62,AN20,AN29,AN38,AN46,AN55)","v":0},null,null,null,null,null,null,null,null,"円"]
[{"$f":"IF(wkPlan5op=1,\"○\",\"×\")","v":"×"},null,null,{"$f":"IF(A62=\"○\",WK!X7,\"\")","v":""},null,null,null,"型",{"$f":"IF(A62=\"○\",人数入力画面!R26+人数入力画面!W26+人数入力画面!AB26,\"\")","v":""},null,null,null,"人",{"$f":"IF(A62=\"○\",VLOOKUP(I62,vlook_plan5op,保険料計算用!T20,TRUE),\"\")","v":""},null,null,null,null,null,"円"]
[]
[]
["※本オプションはプラン５とのセット加入となります。単独でのご加入はできません。"]

{"sheet":"見積書(印刷用背景色なし)","index":9,"n_rows":0,"n_cols":0,"rows_kept":0,"cut":false,"hidden":true,"merged":[[1,37,1,44],[2,1,2,15],[3,35,3,44],[4,35,4,44],[6,0,6,45],[13,6,13,13],[13,16,13,23],[15,0,16,3],[15,4,16,23],[15,26,16,29],[15,30,16,45],[18,0,18,2],[18,3,18,6],[18,7,18,11],[18,12,18,16],[18,17,18,23],[18,26,18,28],[18,29,18,33],[18,34,18,38],[18,39,18,45],[19,45,21,45],[24,0,25,3],[24,4,25,23],[24,26,25,29],[24,30,25,45],[19,17,21,22],[19,23,21,23],[19,26,21,28],[19,29,21,32],[19,33,21,33],[19,34,21,37],[19,0,21,2],[19,3,21,5],[19,6,21,6],[19,7,21,10],[19,11,21,11],[19,12,21,15],[19,16,21,16],[19,38,21,38],[19,39,21,44],[27,29,27,33],[27,34,27,38],[27,39,27,45],[28,0,30,2],[28,3,30,5],[28,6,30,6],[28,7,30,10],[28,11,30,11],[28,12,30,15],[28,16,30,16],[27,0,27,2],[27,3,27,6],[27,7,27,11],[27,12,27,16],[27,17,27,23],[27,26,27,28],[28,38,30,38],[28,39,30,44],[28,45,30,45],[33,0,34,3],[33,4,34,23],[33,26,34,29],[33,30,34,45],[28,17,30,22],[28,23,30,23],[28,26,30,28],[28,29,30,32],[28,33,30,33],[28,34,30,37],[31,26,31,45],[36,29,36,33],[36,34,36,38],[36,39,36,45],[37,0,39,2],[37,3,39,5],[37,6,39,6],[37,7,39,10],[37,11,39,11],[37,12,39,15],[37,16,39,16],[36,0,36,2],[36,3,36,6],[36,7,36,11],[36,12,36,16],[36,17,36,23],[36,26,36,28],[37,38,39,38],[37,39,39,44],[37,45,39,45],[41,0,42,3],[41,4,42,23],[41,26,42,29],[41,30,42,45],[37,17,39,22],[37,23,39,23],[37,26,39,28],[37,29,39,32],[37,33,39,33],[37,34,39,37],[44,29,44,33],[44,34,44,38],[44,39,44,45],[45,0,47,2],[45,3,47,5],[45,6,47,6],[45,7,47,10],[45,11,47,11],[45,12,47,15],[45,16,47,16],[44,0,44,2],[44,3,44,6],[44,7,44,11],[44,12,44,16],[44,17,44,23],[44,26,44,28],[45,38,47,38],[45,39,47,44],[45,45,47,45],[50,0,51,3],[50,4,51,23],[50,26,51,29],[50,30,51,45],[45,17,47,22],[45,23,47,23],[45,26,47,28],[45,29,47,32],[45,33,47,33],[45,34,47,37],[54,0,56,2],[54,3,56,5],[54,6,56,6],[54,7,56,10],[54,11,56,11],[54,12,56,15],[54,16,56,16],[53,0,53,2],[53,3,53,6],[53,7,53,11],[53,12,53,16],[54,17,56,22],[54,23,56,23],[54,26,56,28],[54,29,56,32],[54,33,56,33],[54,34,56,37],[60,35,63,43],[53,29,53,33],[53,34,53,38],[53,39,53,45],[53,17,53,23],[53,26,53,28],[54,38,56,38],[54,39,56,44],[54,45,56,45],[60,44,63,45],[60,26,63,34],[61,0,63,2],[61,3,63,6],[61,7,63,7],[61,8,63,11],[61,12,63,12],[61,13,63,18],[61,19,63,19],[58,0,58,3],[58,4,58,23],[60,0,60,2],[60,3,60,7],[60,8,60,12],[60,13,60,19]]}

{"sheet":"項目","index":10,"n_rows":200,"n_cols":16,"rows_kept":200,"cut":false,"hidden":true,"merged":[]}
["項目一覧",null,null,"※リリース後は項目行変動ないように下に追加する!!!データ取込み時に絶対参照あり。"]
[null,"シート名","項目名","セル番地","初期化対象","初期値","見積書\n入力チェック","見積書\nエラー項目出力用","加入依頼書\n入力チェック","加入依頼書\nエラー項目出力用","加入依頼書\nor　告知書","加入依頼書・告知書\nオブジェクト名","編集方法","データ保存\n取込対象","データ保存時使用","備考"]
[null,"TOP画面","年度","F3","-","-","-","-","-","-","-","-",null,"○",null,"リリース時管理者設定。取込対象外"]
[null,"プラン選択画面","プラン1型","J11","○","ブランク","-","-","-","-","-","-",null,"○"]
[null,"プラン選択画面","プラン1型_前年度","J12","○","ブランク","-","-","-","-","-","-",null,"※",null,"保存対象外。前年度取込時使用"]
[null,"プラン選択画面","プラン2型","U11","○","ブランク","-","-","-","-","-","-",null,"○"]
[null,"プラン選択画面","プラン2型_前年度","U12","○","ブランク","-","-","-","-","-","-",null,"※",null,"保存対象外。前年度取込時使用"]
[null,"プラン選択画面","プラン4型","J36","○","ブランク","-","-","-","-","-","-",null,"○"]
[null,"プラン選択画面","プラン4型_前年度","J37","○","ブランク","-","-","-","-","-","-",null,"※",null,"保存対象外。前年度取込時使用"]
[null,"プラン選択画面","プラン5型","J19","○","ブランク","-","-","-","-","-","-",null,"○"]
[null,"プラン選択画面","プラン5型_前年度","J20","○","ブランク","-","-","-","-","-","-",null,"※",null,"保存対象外。前年度取込時使用"]
[null,"プラン選択画面","オプション型","U19","○","ブランク","-","-","-","-","-","-",null,"○"]
[null,"プラン選択画面","オプション型_前年度","U20","○","ブランク","-","-","-","-","-","-",null,"※",null,"保存対象外。前年度取込時使用"]
[null,"プラン選択画面","プラン6型","AF19","○","ブランク","-","-","-","-","-","-",null,"○"]
[null,"プラン選択画面","プラン6型_前年度","AF20","○","ブランク","-","-","-","-","-","-",null,"※",null,"保存対象外。前年度取込時使用"]
[null,"プラン選択画面","プラン8型","U27","○","ブランク","-","-","-","-","-","-",null,"○"]
[null,"プラン選択画面","プラン8型_前年度","U28","○","ブランク","-","-","-","-","-","-",null,"※",null,"保存対象外。前年度取込時使用"]
[null,"プラン選択画面","プラン9型","AF27","○","ブランク","-","-","-","-","-","-",null,"○"]
[null,"プラン選択画面","プラン9型_前年度","AF28","○","ブランク","-","-","-","-","-","-",null,"※",null,"保存対象外。前年度取込時使用"]
[null,"プラン選択画面","プラン10型","Z36","○","ブランク","-","-","-","-","-","-",null,"○"]
[null,"プラン選択画面","プラン10型_前年度","Z37","○","ブランク","-","-","-","-","-","-",null,"※",null,"保存対象外。前年度取込時使用"]
[null,"人数入力画面","加入月","M6","○","ブランク","-","-","-","-","-","-",null,"○"]
[null,"人数入力画面","園児数_通常保育1","R10","○","ブランク","-","-","-","-","-","-",null,"○"]
[null,"人数入力画面","園児数_通常保育2","R11","○","ブランク","-","-","-","-","-","-",null,"○"]
[null,"人数入力画面","園児数_通常保育3","R12","○","ブランク","-","-","-","-","-","-",null,"○"]
[null,"人数入力画面","園児数_通常保育4","R13","○","ブランク","-","-","-","-","-","-",null,"○"]
[null,"人数入力画面","園児数_通常保育5","R14","○","ブランク","-","-","-","-","-","-",null,"○"]
[null,"人数入力画面","園児数_通常保育6","R15","○","ブランク","-","-","-","-","-","-",null,"○"]
[null,"人数入力画面","園児数_通常保育7","R16","○","ブランク","-","-","-","-","-","-",null,"○"]
[null,"人数入力画面","園児数_通常保育8","R17","○","ブランク","-","-","-","-","-","-",null,"○"]
[null,"人数入力画面","園児数_通常保育9","R18","○","ブランク","-","-","-","-","-","-",null,"○"]
[null,"人数入力画面","園児数_通常保育10","R19","○","ブランク","-","-","-","-","-","-",null,"○"]
[null,"人数入力画面","園児数_通常保育11","R20","○","ブランク","-","-","-","-","-","-",null,"○"]
[null,"人数入力画面","園児数_通常保育12","R21","○","ブランク","-","-","-","-","-","-",null,"○"]
[null,"人数入力画面","園児数_通常保育平均","R26","-","-","-","-","-","-","-","-",null,"△",null,"数式(前年実績なしの場合直入力)"]
[null,"人数入力画面","園児数_一時保育等1","W10","○","ブランク","-","-","-","-","-","-",null,"○"]
[null,"人数入力画面","園児数_一時保育等2","W11","○","ブランク","-","-","-","-","-","-",null,"○"]
[null,"人数入力画面","園児数_一時保育等3","W12","○","ブランク","-","-","-","-","-","-",null,"○"]
[null,"人数入力画面","園児数_一時保育等4","W13","○","ブランク","-","-","-","-","-","-",null,"○"]
[null,"人数入力画面","園児数_一時保育等5","W14","○","ブランク","-","-","-","-","-","-",null,"○"]
[null,"人数入力画面","園児数_一時保育等6","W15","○","ブランク","-","-","-","-","-","-",null,"○"]
[null,"人数入力画面","園児数_一時保育等7","W16","○","ブランク","-","-","-","-","-","-",null,"○"]
[null,"人数入力画面","園児数_一時保育等8","W17","○","ブランク","-","-","-","-","-","-",null,"○"]
[null,"人数入力画面","園児数_一時保育等9","W18","○","ブランク","-","-","-","-","-","-",null,"○"]
[null,"人数入力画面","園児数_一時保育等10","W19","○","ブランク","-","-","-","-","-","-",null,"○"]
[null,"人数入力画面","園児数_一時保育等11","W20","○","ブランク","-","-","-","-","-","-",null,"○"]
[null,"人数入力画面","園児数_一時保育等12","W21","○","ブランク","-","-","-","-","-","-",null,"○"]
[null,"人数入力画面","園児数_一時保育等平均","W26","-","-","-","-","-","-","-","-",null,"△",null,"数式(前年実績なしの場合直入力)"]
[null,"人数入力画面","学童数1","AB10","○","ブランク","-","-","-","-","-","-",null,"○"]
[null,"人数入力画面","学童数2","AB11","○","ブランク","-","-","-","-","-","-",null,"○"]
[null,"人数入力画面","学童数3","AB12","○","ブランク","-","-","-","-","-","-",null,"○"]
[null,"人数入力画面","学童数4","AB13","○","ブランク","-","-","-","-","-","-",null,"○"]
[null,"人数入力画面","学童数5","AB14","○","ブランク","-","-","-","-","-","-",null,"○"]
[null,"人数入力画面","学童数6","AB15","○","ブランク","-","-","-","-","-","-",null,"○"]
[null,"人数入力画面","学童数7","AB16","○","ブランク","-","-","-","-","-","-",null,"○"]
[null,"人数入力画面","学童数8","AB17","○","ブランク","-","-","-","-","-","-",null,"○"]
[null,"人数入力画面","学童数9","AB18","○","ブランク","-","-","-","-","-","-",null,"○"]
[null,"人数入力画面","学童数10","AB19","○","ブランク","-","-","-","-","-","-",null,"○"]
[null,"人数入力画面","学童数11","AB20","○","ブランク","-","-","-","-","-","-",null,"○"]
[null,"人数入力画面","学童数12","AB21","○","ブランク","-","-","-","-","-","-",null,"○"]
[null,"人数入力画面","学童数平均","AB26","-","-","-","-","-","-","-","-",null,"△",null,"数式(前年実績なしの場合直入力)"]
[null,"人数入力画面","職員数1","AG10","○","ブランク","-","-","-","-","-","-",null,"○"]
[null,"人数入力画面","職員数2","AG11","○","ブランク","-","-","-","-","-","-",null,"○"]
[null,"人数入力画面","職員数3","AG12","○","ブランク","-","-","-","-","-","-",null,"○"]
[null,"人数入力画面","職員数4","AG13","○","ブランク","-","-","-","-","-","-",null,"○"]
[null,"人数入力画面","職員数5","AG14","○","ブランク","-","-","-","-","-","-",null,"○"]
[null,"人数入力画面","職員数6","AG15","○","ブランク","-","-","-","-","-","-",null,"○"]
[null,"人数入力画面","職員数7","AG16","○","ブランク","-","-","-","-","-","-",null,"○"]
[null,"人数入力画面","職員数8","AG17","○","ブランク","-","-","-","-","-","-",null,"○"]
[null,"人数入力画面","職員数9","AG18","○","ブランク","-","-","-","-","-","-",null,"○"]
[null,"人数入力画面","職員数10","AG19","○","ブランク","-","-","-","-","-","-",null,"○"]
[null,"人数入力画面","職員数11","AG20","○","ブランク","-","-","-","-","-","-",null,"○"]
[null,"人数入力画面","職員数12","AG21","○","ブランク","-","-","-","-","-","-",null,"○"]
[null,"人数入力画面","職員数平均","AG26","-","-","-","-","-","-","-","-",null,"△",null,"数式(前年実績なしの場合直入力)"]
[null,"人数入力画面","各行事の延参加者数","AY6","○","ブランク","-","-","-","-","-","-",null,"○"]
[null,"人数入力画面","法定乗車定員数の合計","AY10","○","ブランク","-","-","-","-","-","-",null,"○"]
[null,"人数入力画面","直近会計年度の平均被用者数","AY14","○","ブランク","-","-","-","-","-","-",null,"○"]
[null,"人数入力画面","加入月の前々月末時点職員人数の合計","AY19","○","ブランク","-","-","-","-","-","-",null,"○"]
[null,"人数入力画面","法人全体(日本国内)の直近会計年度の全事業収入の合計金額","AY23","○","ブランク","-","-","-","-","-","-",null,"○"]
[null,"加入者・保険会社情報入力画面","郵便番号(前)","G6","○","ブランク","-","-",{"$f":"IF(TRIM(INDIRECT(B80 & \"!\" & D80))=\"\",\"NG\",\"OK\")","v":"NG"},{"$f":"IF(I80=\"NG\",C80&\"、\",\"\")","v":"郵便番号(前)、"},"加入依頼書","txt郵便番号_前",1,"○"]
[null,"加入者・保険会社情報入力画面","郵便番号(後)","K6","○","ブランク","-","-",{"$f":"IF(TRIM(INDIRECT(B81 & \"!\" & D81))=\"\",\"NG\",\"OK\")","v":"NG"},{"$f":"IF(I81=\"NG\",C81&\"、\",\"\")","v":"郵便番号(後)、"},"加入依頼書","txt郵便番号_後",1,"○"]
[null,"加入者・保険会社情報入力画面","TEL(前)","Q6","○","ブランク","-","-",{"$f":"IF(TRIM(INDIRECT(B82 & \"!\" & D82))=\"\",\"NG\",\"OK\")","v":"NG"},{"$f":"IF(I82=\"NG\",C82&\"、\",\"\")","v":"TEL(前)、"},"加入依頼書","txtTEL_前",1,"○"]
[null,"加入者・保険会社情報入力画面","TEL(中)","U6","○","ブランク","-","-","NG","TEL(中)、","加入依頼書","txtTEL_中",1,"○"]
[null,"加入者・保険会社情報入力画面","TEL(後)","Y6","○","ブランク","-","-","NG","TEL(後)、","加入依頼書","txtTEL_後",1,"○"]
[null,"加入者・保険会社情報入力画面","FAX(前)","AE6","○","ブランク","-","-","-","-","加入依頼書","txtFAX_前",1,"○"]
[null,"加入者・保険会社情報入力画面","FAX(中)","AI6","○","ブランク","-","-","-","-","加入依頼書","txtFAX_中",1,"○"]
[null,"加入者・保険会社情報入力画面","FAX(後)","AM6","○","ブランク","-","-","-","-","加入依頼書","txtFAX_後",1,"○"]
[null,"加入者・保険会社情報入力画面","住所(フリガナ)","G8","○","ブランク","-","-","NG","住所(フリガナ)、","加入依頼書","txt住所_フリガナ",1,"○"]
[null,"加入者・保険会社情報入力画面","住所(漢字)","G9","○","ブランク","-","-","NG","住所(漢字)、","加入依頼書","txt住所_漢字",1,"○"]
[null,"加入者・保険会社情報入力画面","保育園名(フリガナ)","G11","○","ブランク","-","-","NG","保育園名(フリガナ)、","加入依頼書","txt保育園名_フリガナ",1,"○"]
[null,"加入者・保険会社情報入力画面","保育園名(漢字)","G12","○","ブランク","-","-","NG","保育園名(漢字)、","加入依頼書","txt保育園名_漢字",1,"○"]
[null,"加入者・保険会社情報入力画面","法人名(フリガナ)","G14","○","ブランク","-","-","NG","法人名(フリガナ)、","加入依頼書","txt法人名_フリガナ",1,"○"]
[null,"加入者・保険会社情報入力画面","法人名(漢字)","G15","○","ブランク",{"$f":"IF(TRIM(INDIRECT(B93 & \"!\" & D93))=\"\",\"NG\",\"OK\")","v":"NG"},{"$f":"IF(G93=\"NG\",C93&\"、\",\"\")","v":"法人名(漢字)、"},"NG","法人名(漢字)、","加入依頼書","txt法人名_漢字",1,"○"]
[null,"加入者・保険会社情報入力画面","保険始期(年)","G19","○","ブランク",{"$f":"IF(TRIM(INDIRECT(B94 & \"!\" & D94))=\"\",\"NG\",\"OK\")","v":"NG"},{"$f":"IF(G94=\"NG\",C94&\"、\",\"\")","v":"保険始期(年)、"},"NG","保険始期(年)、","加入依頼書","txt保険始期_年",1,"○"]
[null,"加入者・保険会社情報入力画面","保険始期(月)","K19","○","ブランク",{"$f":"IF(TRIM(INDIRECT(B95 & \"!\" & D95))=\"\",\"NG\",\"OK\")","v":"NG"},{"$f":"IF(G95=\"NG\",C95&\"、\",\"\")","v":"保険始期(月)、"},"NG","保険始期(月)、","加入依頼書","txt保険始期_月",1,"○"]
[null,"加入者・保険会社情報入力画面","保険始期(日)","N19","-","-","-","-","-","-","加入依頼書","txt保険始期_日",1,null,null,"1日固定"]
[null,"加入者・保険会社情報入力画面","保険終期(年)","V19","-","-","-","-","-","-","-","-",null,null,null,"数式"]
[null,"加入者・保険会社情報入力画面","保険終期(月)","Z19","-","-","-","-","-","-","-","-",null,null,null,"数式"]
[null,"加入者・保険会社情報入力画面","保険終期(日)","AC19","-","-","-","-","-","-","-","-",null,null,null,"1日固定"]
[null,"加入者・保険会社情報入力画面","加入者番号","AK19","○","ブランク","-","-",{"$f":"IF(wk新継区分=2,IF(TRIM(INDIRECT(B100 & \"!\" & D100))=\"\",\"NG\",\"OK\"),\"OK\")","v":"OK"},{"$f":"IF(I100=\"NG\",C100&\"、\",\"\")","v":""},"加入依頼書","txt加入者コード",1,"○"]
[null,"加入者・保険会社情報入力画面","部担コード","G21","○","ブランク","-","-","NG","部担コード、","加入依頼書","txt部担コード",2,"○"]
[null,"加入者・保険会社情報入力画面","部店名","G23","○","ブランク","-","-","NG","部店名、","加入依頼書","txt部店名",1,"○"]
[null,"加入者・保険会社情報入力画面","担当店名","G25","○","ブランク","-","-","NG","担当店名、","加入依頼書","txt担当店名",1,"○"]
[null,"加入者・保険会社情報入力画面","代理店コード","V21","○","ブランク","-","-","NG","代理店コード、","加入依頼書","txt代理店コード",2,"○"]
[null,"加入者・保険会社情報入力画面","サブコード","V23","○","ブランク","-","-","NG","サブコード、","加入依頼書","txtサブコード",2,"○"]
[null,"加入者・保険会社情報入力画面","代理店名(漢字)","V25","○","ブランク",{"$f":"IF(TRIM(INDIRECT(B106 & \"!\" & D106))=\"\",\"NG\",\"OK\")","v":"NG"},{"$f":"IF(G106=\"NG\",C106&\"、\",\"\")","v":"代理店名(漢字)、"},"NG","代理店名(漢字)、","加入依頼書","txt代理店名",1,"○"]
[null,"加入者・保険会社情報入力画面","自動車登録番号1","E31","○","ブランク","-","-","-","-","-","-",null,"○"]
[null,"加入者・保険会社情報入力画面","自動車登録番号2","E32","○","ブランク","-","-","-","-","-","-",null,"○"]
[null,"加入者・保険会社情報入力画面","自動車登録番号3","E33","○","ブランク","-","-","-","-","-","-",null,"○"]
[null,"加入者・保険会社情報入力画面","自動車登録番号4","E34","○","ブランク","-","-","-","-","-","-",null,"○"]
[null,"加入者・保険会社情報入力画面","自動車登録番号5","E35","○","ブランク","-","-","-","-","-","-",null,"○"]
[null,"加入者・保険会社情報入力画面","自動車登録番号6","E36","○","ブランク","-","-","-","-","-","-",null,"○"]
[null,"加入者・保険会社情報入力画面","法定乗車定員数1","V31","○","ブランク","-","-","-","-","-","-",null,"○"]
[null,"加入者・保険会社情報入力画面","法定乗車定員数2","V32","○","ブランク","-","-","-","-","-","-",null,"○"]
[null,"加入者・保険会社情報入力画面","法定乗車定員数3","V33","○","ブランク","-","-","-","-","-","-",null,"○"]
[null,"加入者・保険会社情報入力画面","法定乗車定員数4","V34","○","ブランク","-","-","-","-","-","-",null,"○"]
[null,"加入者・保険会社情報入力画面","法定乗車定員数5","V35","○","ブランク","-","-","-","-","-","-",null,"○"]
[null,"加入者・保険会社情報入力画面","法定乗車定員数6","V36","○","ブランク","-","-","-","-","-","-",null,"○"]
[null,"加入者・保険会社情報入力画面","合計保険料","M41","○","ブランク","-","-","-","-","-","-"]
[null,"加入者・保険会社情報入力画面","見積書作成日","K49","○",{"$f":"TODAY()","v":"2024-12-10"},{"$f":"IF(TRIM(INDIRECT(B120 & \"!\" & D120))=\"\",\"NG\",\"OK\")","v":"OK"},{"$f":"IF(G120=\"NG\",C120&\"、\",\"\")","v":""},"-","-","-","-",null,"○"]
[null,"見積書","プラン1_人数","M20","-","-","-","-","-","-","加入依頼書","txtプラン1_人数",3,null,null,"数式"]
[null,"見積書","プラン1_1人あたり保険料","H20","-","-","-","-","-","-","加入依頼書","txtプラン1_1人あたり保険料",3,null,null,"数式"]
[null,"見積書","プラン1_合計保険料","R20","-","-","-","-","-","-","加入依頼書","txtプラン1_合計保険料",3,null,null,"数式"]
[null,"見積書","プラン2_人数","M29","-","-","-","-","-","-","加入依頼書","txtプラン2_人数",3,null,null,"数式"]
[null,"見積書","プラン2_1人あたり保険料","H29","-","-","-","-","-","-","加入依頼書","txtプラン2_1人あたり保険料",3,null,null,"数式"]
[null,"見積書","プラン2_合計保険料","R29","-","-","-","-","-","-","加入依頼書","txtプラン2_合計保険料",3,null,null,"数式"]
[null,"見積書","プラン3_人数","M38","-","-","-","-","-","-","加入依頼書","txtプラン3_人数",3,null,null,"数式"]
[null,"見積書","プラン3_1人あたり保険料","H38","-","-","-","-","-","-","加入依頼書","txtプラン3_1人あたり保険料",3,null,null,"数式"]
[null,"見積書","プラン3_合計保険料","R38","-","-","-","-","-","-","加入依頼書","txtプラン3_合計保険料",3,null,null,"数式"]
[null,"見積書","プラン4_人数","M46","-","-","-","-","-","-","加入依頼書","txtプラン4_人数",3,null,null,"数式"]
[null,"見積書","プラン4_1人あたり保険料","H46","-","-","-","-","-","-","加入依頼書","txtプラン4_1人あたり保険料",3,null,null,"数式"]
[null,"見積書","プラン4_合計保険料","R46","-","-","-","-","-","-","加入依頼書","txtプラン4_合計保険料",3,null,null,"数式"]
[null,"見積書","プラン5_人数","M55","-","-","-","-","-","-","加入依頼書","txtプラン5_人数",3,null,null,"数式"]
[null,"見積書","プラン5_1人あたり保険料","H55","-","-","-","-","-","-","加入依頼書","txtプラン5_1人あたり保険料",3,null,null,"数式"]
[null,"見積書","プラン5_合計保険料","R55","-","-","-","-","-","-","加入依頼書","txtプラン5_合計保険料",3,null,null,"数式"]
[null,"見積書","オプション_合計保険料","N62","-","-","-","-","-","-","加入依頼書","txtオプション_合計保険料",3,null,null,"数式"]
[null,"見積書","プラン6_人数","AI20","-","-","-","-","-","-","加入依頼書","txtプラン6_人数",3,null,null,"数式"]
[null,"見積書","プラン6_合計保険料","AN20","-","-","-","-","-","-","加入依頼書","txtプラン6_合計保険料",3,null,null,"数式"]
[null,"見積書","プラン7_人数","AI29","-","-","-","-","-","-","加入依頼書","txtプラン7_人数",3,null,null,"数式"]
[null,"見積書","プラン7_1人あたり保険料","AD29","-","-","-","-","-","-","加入依頼書","txtプラン7_1人あたり保険料",3,null,null,"数式"]
[null,"見積書","プラン7_合計保険料","AN29","-","-","-","-","-","-","加入依頼書","txtプラン7_合計保険料",3,null,null,"数式"]
[null,"見積書","プラン8_収入金額","AI38","-","-","-","-","-","-","加入依頼書","txtプラン8_収入金額",5,null,null,"数式"]
[null,"見積書","プラン8_合計保険料","AN38","-","-","-","-","-","-","加入依頼書","txtプラン8_合計保険料",3,null,null,"数式"]
[null,"見積書","プラン9_収入金額","AI46","-","-","-","-","-","-","加入依頼書","txtプラン9_収入金額",5,null,null,"数式"]
[null,"見積書","プラン9_合計保険料","AN46","-","-","-","-","-","-","加入依頼書","txtプラン9_合計保険料",3,null,null,"数式"]
[null,"見積書","プラン10_人数","AI55","-","-","-","-","-","-","加入依頼書","txtプラン10_人数",3,null,null,"数式"]
[null,"見積書","プラン10_合計保険料","AN55","-","-","-","-","-","-","加入依頼書","txtプラン10_合計保険料",3,null,null,"数式"]
[null,"見積書","年間合計保険料","AJ61","-","-","-","-","-","-","加入依頼書","txt年間合計保険料",3,null,null,"数式"]
[null,"WK","プラン1_チェック有無","W2","○",0,"-","-","-","-","-","-",null,"○"]
[null,"WK","プラン2_チェック有無","W3","○",0,"-","-","-","-","-","-",null,"○"]
[null,"WK","プラン3_チェック有無","W4","○",0,"-","-","-","-","-","-",null,"○"]
[null,"WK","プラン4_チェック有無","W5","○",0,"-","-","-","-","-","-",null,"○"]
[null,"WK","プラン5_チェック有無","W6","○",0,"-","-","-","-","-","-",null,"○"]
[null,"WK","オプション_チェック有無","W7","○",0,"-","-","-","-","-","-",null,"○"]
[null,"WK","プラン6_チェック有無","W8","○",0,"-","-","-","-","-","-",null,"○"]
[null,"WK","プラン7_チェック有無","W9","○",0,"-","-","-","-","-","-",null,"○"]
[null,"WK","プラン8_チェック有無","W10","○",0,"-","-","-","-","-","-",null,"○"]
[null,"WK","プラン9_チェック有無","W11","○",0,"-","-","-","-","-","-",null,"○"]
[null,"WK","プラン10_チェック有無","W12","○",0,"-","-","-","-","-","-",null,"○"]
[null,"WK","プラン1_型","X2","-","-","-","-","-","-","加入依頼書","txtプラン1_型",1,null,null,"数式"]
[null,"WK","プラン2_型","X3","-","-","-","-","-","-","加入依頼書","txtプラン2_型",1,null,null,"数式"]
[null,"WK","プラン4_型","X5","-","-","-","-","-","-","加入依頼書","txtプラン4_型",1,null,null,"数式"]
[null,"WK","プラン5_型","X6","-","-","-","-","-","-","加入依頼書","txtプラン5_型",1,null,null,"数式"]
[null,"WK","オプション_型","X7","-","-","-","-","-","-","加入依頼書","txtオプション_型",1,null,null,"数式"]
[null,"WK","プラン6_型","X8","-","-","-","-","-","-","加入依頼書","txtプラン6_型",1,null,null,"数式"]
[null,"WK","プラン8_型","X10","-","-","-","-","-","-","加入依頼書","txtプラン8_型",1,null,null,"数式"]
[null,"WK","プラン9_型","X11","-","-","-","-","-","-","加入依頼書","txtプラン9_型",1,null,null,"数式"]
[null,"WK","プラン10_型","X12","-","-","-","-","-","-","加入依頼書","txtプラン10_型",1,null,null,"数式"]
[null,"WK","分園含む","AA2","○",false,"-","-","-","-","加入依頼書","txt分園含む",4,"○"]
[null,"WK","新規or継続","AA6","○","ブランク","-","-","-","-","-","-",null,"○"]
[null,"WK","前年実績なし","AA10","○",false,"-","-","-","-","-","-",null,"○"]
[null,"WK","プラン1_園児人数","AH4","-","-","-","-","-","-","加入依頼書","txtプラン1_園児人数",3,null,null,"数式"]
[null,"WK","プラン1_学童人数","AI4","-","-","-","-","-","-","加入依頼書","txtプラン1_学童人数",3,null,null,"数式"]
[null,"WK","プラン1_職員人数","AJ4","-","-","-","-","-","-","加入依頼書","txtプラン1_職員人数",3,null,null,"数式"]
[null,"WK","プラン5_園児人数","AH8","-","-","-","-","-","-","加入依頼書","txtプラン5_園児人数",3,null,null,"数式"]
[null,"WK","プラン5_学童人数","AI8","-","-","-","-","-","-","加入依頼書","txtプラン5_学童人数",3,null,null,"数式"]
[null,"WK","プラン6_園児人数","AH12","-","-","-","-","-","-","加入依頼書","txtプラン6_園児人数",3,null,null,"数式"]
[null,"WK","プラン6_学童人数","AI12","-","-","-","-","-","-","加入依頼書","txtプラン6_学童人数",3,null,null,"数式"]
[null,"WK","プラン10_園児人数","AH16","-","-","-","-","-","-","加入依頼書","txtプラン10_園児人数",3,null,null,"数式"]
[null,"WK","プラン10_学童人数","AI16","-","-","-","-","-","-","加入依頼書","txtプラン10_学童人数",3,null,null,"数式"]
[null,"WK","自動車登録番号1","AN4","-","-",{"$f":"IF(wkPlan3=1,IF(TRIM(INDIRECT(B181 & \"!\" & D181))=\"\",\"NG\",\"OK\"),\"OK\")","v":"OK"},{"$f":"IF(G181=\"NG\",MID(C181,1,LEN(C181)-1)&\"、\",\"\")","v":""},{"$f":"IF(wkPlan3=1,IF(TRIM(INDIRECT(B181 & \"!\" & D181))=\"\",\"NG\",\"OK\"),\"OK\")","v":"OK"},{"$f":"IF(I181=\"NG\",MID(C181,1,LEN(C181)-1)&\"、\",\"\")","v":""},"告知書","txt自動車登録番号1",1,null,null,"数式(上詰め)"]
[null,"WK","自動車登録番号2","AN5","-","-","-","-","-","-","告知書","txt自動車登録番号2",1,null,null,"数式(上詰め)"]
[null,"WK","自動車登録番号3","AN6","-","-","-","-","-","-","告知書","txt自動車登録番号3",1,null,null,"数式(上詰め)"]
[null,"WK","自動車登録番号4","AN7","-","-","-","-","-","-","告知書","txt自動車登録番号4",1,null,null,"数式(上詰め)"]
[null,"WK","自動車登録番号5","AN8","-","-","-","-","-","-","告知書","txt自動車登録番号5",1,null,null,"数式(上詰め)"]
[null,"WK","自動車登録番号6","AN9","-","-","-","-","-","-","告知書","txt自動車登録番号6",1,null,null,"数式(上詰め)"]
[null,"WK","法定乗車定員数1","AO4","-","-",{"$f":"IF(wkPlan3=1,IF(TRIM(INDIRECT(B187 & \"!\" & D187))=\"\",\"NG\",\"OK\"),\"OK\")","v":"OK"},{"$f":"IF(G187=\"NG\",MID(C187,1,LEN(C187)-1)&\"、\",\"\")","v":""},{"$f":"IF(wkPlan3=1,IF(TRIM(INDIRECT(B187 & \"!\" & D187))=\"\",\"NG\",\"OK\"),\"OK\")","v":"OK"},{"$f":"IF(I187=\"NG\",MID(C187,1,LEN(C187)-1)&\"、\",\"\")","v":""},"告知書","txt法定乗車定員数1",3,null,null,"数式(上詰め)"]
[null,"WK","法定乗車定員数2","AO5","-","-","-","-","-","-","告知書","txt法定乗車定員数2",3,null,null,"数式(上詰め)"]
[null,"WK","法定乗車定員数3","AO6","-","-","-","-","-","-","告知書","txt法定乗車定員数3",3,null,null,"数式(上詰め)"]
[null,"WK","法定乗車定員数4","AO7","-","-","-","-","-","-","告知書","txt法定乗車定員数4",3,null,null,"数式(上詰め)"]
[null,"WK","法定乗車定員数5","AO8","-","-","-","-","-","-","告知書","txt法定乗車定員数5",3,null,null,"数式(上詰め)"]
[null,"WK","法定乗車定員数6","AO9","-","-","-","-","-","-","告知書","txt法定乗車定員数6",3,null,null,"数式(上詰め)"]
[null,"WK","法定乗車定員数合計","AO10","-","-","-","-","-","-","告知書","txt法定乗車定員数合計",3,null,null,"数式"]
[null,"WK","法定外補償規定の備え付け有無","AR2","○","ブランク","-","-","-","-","-","-",null,"○",null,"加入依頼書楕円表示・非表示"]
[null,"WK","会員OKor会員NG","AU2","○","ブランク","-","-","-","-","加入依頼書","txt会員OK",4,"○"]
[null,"加入者・保険会社情報入力画面","保育園名(漢字)","G12","-","-","-","-","-","-","告知書","txt保育園名_告知書",1,null,null,"告知書印字用に追加（Ver1.01）"]
[null,"加入者・保険会社情報入力画面","代理店名(フリガナ)","AJ25","○","ブランク","-","-",{"$f":"IF(TRIM(INDIRECT(B197 & \"!\" & D197))=\"\",\"NG\",\"OK\")","v":"NG"},{"$f":"IF(I197=\"NG\",C197&\"、\",\"\")","v":"代理店名(フリガナ)、"},"加入依頼書","txt代理店名_フリガナ",6,"○",null,"Ver2.00追加"]
[null,"WK","加入依頼書表示用年度","BB2","-","-","-","-","-","-","加入依頼書","txt年度",1,null,null,"数式"]
[null,null,null,null,null,"必須トータルチェック",{"$f":"IF(COUNTIF(G3:G198,\"NG\")>0,\"NG\",\"OK\")","v":"NG"},{"$f":"CONCATENATE(H93,H94,H95,H106,H120,H181,H187)","v":"法人名(漢字)、保険始期(年)、保険始期(月)、代理店名(漢字)、"},{"$f":"IF(COUNTIF(I3:I198,\"NG\")>0,\"NG\",\"OK\")","v":"NG"},{"$f":"CONCATENATE(J80,J81,J82,J83,J84,J88,J89,J90,J91,J92,J93,J94,J95,J100,J101,J102,J103,J104,J105,J106,J181,J187,J197)","v":"郵便番号(前)、郵便番号(後)、TEL(前)、TEL(中)、TEL(後)、住所(フリガナ)、住所(漢字)、保育園名(フリガナ)、保育園名(漢字)、法人名(フリガナ)、法人名(漢字)、保険始期(年)、保険始期(月)、部担コード、部店名、担当店名、代理店コード、サブコード、代理店名(漢字)、代理店名(フリガナ)、"}]
[null,null,null,null,null,null,null,{"$f":"IF(H199=\"\",\"\",MID(H199,1,LEN(H199)-1))","v":"法人名(漢字)、保険始期(年)、保険始期(月)、代理店名(漢字)"},null,{"$f":"IF(J199=\"\",\"\",MID(J199,1,LEN(J199)-1))","v":"郵便番号(前)、郵便番号(後)、TEL(前)、TEL(中)、TEL(後)、住所(フリガナ)、住所(漢字)、保育園名(フリガナ)、保育園名(漢字)、法人名(フリガナ)、法人名(漢字)、保険始期(年)、保険始期(月)、部担コード、部店名、担当店名、代理店コード、サブコード、代理店名(漢字)、代理店名(フリガナ)"}]

{"sheet":"WK","index":11,"n_rows":28,"n_cols":54,"rows_kept":28,"cut":false,"hidden":true,"merged":[]}
["年度",null,"プラン1型",null,"プラン2型",null,"プラン4型",null,"プラン5型",null,"オプション",null,"プラン6型",null,"プラン8型",null,"プラン9型",null,"プラン10型","←開発途中で未使用になった",null,"プラン","チェック有無(有:1 無:0)","選択型","オブジェクト名","前年型クリア用","分園含むチェック",null,null,"実績計算書入力チェック",null,null,null,"加入依頼書印字用(0が印字されないように条件付き)",null,null,null,null,"告知書印字用",null,null,null,null,"法定外補償規定の備え付け",null,null,"会員OK(1)or会員NG(2)",null,null,"保険始期チェック",null,null,null,"加入依頼書年度表示"]
[{"$f":"IF(管理者設定画面１!I4=\"\",\"\",管理者設定画面１!I4)","v":2025},null,"A1",null,"A1",null,"A",null,"ER",null,"Q",null,"I",null,"T",null,"N",null,"M",null,null,"プラン１",0,{"$f":"IF(wkPlan1=0,\"\",IF(プラン選択画面!J11=\"\",\"\",プラン選択画面!J11))","v":""},"chkPlan1","prePlan1",false,null,null,"プラン該当(該当:1)",{"$f":"IF(OR(wkPlan1=1,wkPlan5=1,wkPlan5op=1,wkPlan6=1,wkPlan10=1),1,0)","v":0},null,null,"プラン1",null,null,null,null,"自動車明細書(上詰め、プラン3付帯ない場合非表示)",null,null,null,null,null,null,null,true,null,null,"入力値",{"$f":"IFERROR(DATE(加入者・保険会社情報入力画面!G19,加入者・保険会社情報入力画面!K19,加入者・保険会社情報入力画面!N19),\"\")","v":""},null,null,{"$f":"\"[\"&A2&\"年度版(令和\"&A2-2018&\"年度版)]\"","v":"[2025年度版(令和7年度版)]"}]
[{"$f":"IF(管理者設定画面１!AW4=\"\",\"\",管理者設定画面１!AW4)","v":""},null,"A2",null,"A2",null,"B",null,"FR",null,"R",null,"J",null,"U",null,"O",null,"K",null,null,"プラン２",0,{"$f":"IF(wkPlan2=0,\"\",IF(プラン選択画面!U11=\"\",\"\",プラン選択画面!U11))","v":""},"chkPlan2","prePlan2",null,null,null,"加入月入力チェック",{"$f":"IF(AND($AE$2=1,wk前年実績なし=FALSE),IF(人数入力画面!M6=\"\",\"NG\",\"OK\"),\"\")","v":""},null,null,"園児","学童","職員",null,null,null,"自動車登録番号","法定乗車定員数",null,null,null,null,null,null,null,null,"年度FROM",{"$f":"IFERROR(DATE(TOP画面!F3,4,1),\"\")","v":"2025-04-01"}]
[null,null,"A3",null,"A3",null,"C",null,"E",null,"S",null,null,null,null,null,"P",null,"L",null,null,"プラン３",0,"-","chkPlan3","-",null,null,null,"通常保育入力数",{"$f":"IF(AND($AE$2=1,wk前年実績なし=FALSE),IF(COUNTA(人数入力画面!R10:U21)=12,\"OK\",\"NG\"),\"\")","v":""},null,null,{"$f":"IF(wkPlan1=1,人数入力画面!R26+人数入力画面!W26,\"\")","v":""},{"$f":"IF(wkPlan1=1,人数入力画面!AB26,\"\")","v":""},{"$f":"IF(wkPlan1=1,人数入力画面!AG26,\"\")","v":""},null,null,"①",{"$f":"IF(wkPlan3=0,\"\",IFERROR(INDEX(加入者・保険会社情報入力画面!$E:$E,SMALL(IF(加入者・保険会社情報入力画面!$E$31:$E$36<>\"\",ROW(加入者・保険会社情報入力画面!$E$31:$E$36)),ROW()-3)),\"\"))","v":""},{"$f":"IFERROR(IF(VLOOKUP(AN4,加入者・保険会社情報入力画面!$E$31:$AD$36,18,FALSE)=\"\",\"\",VLOOKUP(AN4,加入者・保険会社情報入力画面!$E$31:$AD$36,18,FALSE)),\"\")","v":""},null,null,null,null,null,null,null,null,"年度TO",{"$f":"IFERROR(DATE(TOP画面!F3+1,3,31),\"\")","v":"2026-03-31"}]
[null,null,"A4",null,"A4",null,"D",null,"F",null,null,null,null,null,null,null,null,null,"ME",null,null,"プラン４",0,{"$f":"IF(wkPlan4=0,\"\",IF(プラン選択画面!J36=\"\",\"\",プラン選択画面!J36))","v":""},"chkPlan4","prePlan4","新規(1)or継続(2)",null,null,"一時保育等入力数",{"$f":"IF(AND($AE$2=1,wk前年実績なし=FALSE),IF(COUNTA(人数入力画面!W10:Z21)=12,\"OK\",\"NG\"),\"\")","v":""},null,null,null,null,null,null,null,"②",{"$f":"IF(wkPlan3=0,\"\",IFERROR(INDEX(加入者・保険会社情報入力画面!$E:$E,SMALL(IF(加入者・保険会社情報入力画面!$E$31:$E$36<>\"\",ROW(加入者・保険会社情報入力画面!$E$31:$E$36)),ROW()-3)),\"\"))","v":""},{"$f":"IFERROR(IF(VLOOKUP(AN5,加入者・保険会社情報入力画面!$E$31:$AD$36,18,FALSE)=\"\",\"\",VLOOKUP(AN5,加入者・保険会社情報入力画面!$E$31:$AD$36,18,FALSE)),\"\")","v":""},null,null,null,null,null,null,null,null,"チェック",{"$f":"IF(AND(AY3<=AY2,AY2<=AY4),\"OK\",\"NG\")","v":"NG"}]
["TOP画面で選択されている年度",null,"A5",null,"A5",null,null,null,"GR",null,null,null,null,null,null,null,null,null,"KE",null,null,"プラン５",0,{"$f":"IF(wkPlan5=0,\"\",IF(プラン選択画面!J19=\"\",\"\",プラン選択画面!J19))","v":""},"chkPlan5","prePlan5",1,null,null,"学童数入力数",{"$f":"IF(AND($AE$2=1,wk前年実績なし=FALSE),IF(COUNTA(人数入力画面!AB10:AE21)=12,\"OK\",\"NG\"),\"\")","v":""},null,null,"プラン5",null,null,null,null,"③",{"$f":"IF(wkPlan3=0,\"\",IFERROR(INDEX(加入者・保険会社情報入力画面!$E:$E,SMALL(IF(加入者・保険会社情報入力画面!$E$31:$E$36<>\"\",ROW(加入者・保険会社情報入力画面!$E$31:$E$36)),ROW()-3)),\"\"))","v":""},{"$f":"IFERROR(IF(VLOOKUP(AN6,加入者・保険会社情報入力画面!$E$31:$AD$36,18,FALSE)=\"\",\"\",VLOOKUP(AN6,加入者・保険会社情報入力画面!$E$31:$AD$36,18,FALSE)),\"\")","v":""}]
[{"$f":"TOP画面!F3","v":2025},null,"A6",null,"A6",null,null,null,"HR",null,null,null,null,null,null,null,null,null,"LE",null,null,"オプション",0,{"$f":"IF(wkPlan5op=0,\"\",IF(プラン選択画面!U19=\"\",\"\",プラン選択画面!U19))","v":""},"chkPlan5op","prePlan5op",null,null,null,"職員数入力数",{"$f":"IF(AND($AE$2=1,wk前年実績なし=FALSE),IF(COUNTA(人数入力画面!AG10:AJ21)=12,\"OK\",\"NG\"),\"\")","v":""},null,null,"園児","学童",null,null,null,"④",{"$f":"IF(wkPlan3=0,\"\",IFERROR(INDEX(加入者・保険会社情報入力画面!$E:$E,SMALL(IF(加入者・保険会社情報入力画面!$E$31:$E$36<>\"\",ROW(加入者・保険会社情報入力画面!$E$31:$E$36)),ROW()-3)),\"\"))","v":""},{"$f":"IFERROR(IF(VLOOKUP(AN7,加入者・保険会社情報入力画面!$E$31:$AD$36,18,FALSE)=\"\",\"\",VLOOKUP(AN7,加入者・保険会社情報入力画面!$E$31:$AD$36,18,FALSE)),\"\")","v":""}]
[null,null,"A7",null,"A7",null,null,null,"G",null,null,null,null,null,null,null,null,null,null,null,null,"プラン６",0,{"$f":"IF(wkPlan6=0,\"\",IF(プラン選択画面!AF19=\"\",\"\",プラン選択画面!AF19))","v":""},"chkPlan6","prePlan6",null,null,null,"前年実績なしの場合",{"$f":"IF(AND($AE$2=1,wk前年実績なし=TRUE),IF(COUNTA(人数入力画面!R26,人数入力画面!W26,人数入力画面!AB26,人数入力画面!AG26)=4,\"OK\",\"NG\"),\"\")","v":""},null,null,{"$f":"IF(wkPlan5=1,人数入力画面!R26+人数入力画面!W26,\"\")","v":""},{"$f":"IF(wkPlan5=1,人数入力画面!AB26,\"\")","v":""},null,null,null,"⑤",{"$f":"IF(wkPlan3=0,\"\",IFERROR(INDEX(加入者・保険会社情報入力画面!$E:$E,SMALL(IF(加入者・保険会社情報入力画面!$E$31:$E$36<>\"\",ROW(加入者・保険会社情報入力画面!$E$31:$E$36)),ROW()-3)),\"\"))","v":""},{"$f":"IFERROR(IF(VLOOKUP(AN8,加入者・保険会社情報入力画面!$E$31:$AD$36,18,FALSE)=\"\",\"\",VLOOKUP(AN8,加入者・保険会社情報入力画面!$E$31:$AD$36,18,FALSE)),\"\")","v":""}]
[null,null,"A8",null,"A8",null,null,null,"H",null,null,null,null,null,null,null,null,null,null,null,null,"プラン７",0,"-","chkPlan7","-","前年実績なし",null,null,"トータルチェック",{"$f":"IF(AE2=1,IF(COUNTIF(AE3:AE8,\"NG\")>0,\"NG\",\"OK\"),\"\")","v":""},null,null,null,null,null,null,null,"⑥",{"$f":"IF(wkPlan3=0,\"\",IFERROR(INDEX(加入者・保険会社情報入力画面!$E:$E,SMALL(IF(加入者・保険会社情報入力画面!$E$31:$E$36<>\"\",ROW(加入者・保険会社情報入力画面!$E$31:$E$36)),ROW()-3)),\"\"))","v":""},{"$f":"IFERROR(IF(VLOOKUP(AN9,加入者・保険会社情報入力画面!$E$31:$AD$36,18,FALSE)=\"\",\"\",VLOOKUP(AN9,加入者・保険会社情報入力画面!$E$31:$AD$36,18,FALSE)),\"\")","v":""}]
["使用する保険料テーブル",null,"A9",null,"A9",null,null,null,null,null,null,null,null,null,null,null,null,null,null,null,null,"プラン８",0,{"$f":"IF(wkPlan8=0,\"\",IF(プラン選択画面!U27=\"\",\"\",プラン選択画面!U27))","v":""},"chkPlan8","prePlan8",false,null,null,null,null,null,null,"プラン6",null,null,null,null,null,"合計",{"$f":"IF(wkPlan3=0,\"\",SUM(AO4:AO9))","v":""}]
[{"$f":"IF(A7=管理者設定画面１!I4,\"①\",IF(A7=管理者設定画面１!AW4,\"②\",\"\"))","v":"①"},null,"B1",null,"B1",null,null,null,null,null,null,null,null,null,null,null,null,null,null,null,null,"プラン９",0,{"$f":"IF(wkPlan9=0,\"\",IF(プラン選択画面!AF27=\"\",\"\",プラン選択画面!AF27))","v":""},"chkPlan9","prePlan9",null,null,null,null,null,null,null,"園児","学童"]
[null,null,"B2",null,"B2",null,null,null,null,null,null,null,null,null,null,null,null,null,null,null,null,"プラン１０",0,{"$f":"IF(wkPlan10=0,\"\",IF(プラン選択画面!Z36=\"\",\"\",プラン選択画面!Z36))","v":""},"chkPlan10","prePlan10",null,null,null,null,null,null,null,{"$f":"IF(wkPlan6=1,人数入力画面!R26+人数入力画面!W26,\"\")","v":""},{"$f":"IF(wkPlan6=1,人数入力画面!AB26,\"\")","v":""}]
[null,null,"B3",null,"B3",null,null,null,null,null,null,null,null,null,null,null,null,null,null,null,null,"プラン選択数",{"$f":"SUM(W2:W12)","v":0}]
[null,null,"B4",null,"B4",null,null,null,null,null,null,null,null,null,null,null,null,null,null,null,null,null,null,null,null,null,null,null,null,null,null,null,null,"プラン10"]
[null,null,"B5",null,"B5",null,null,null,null,null,null,null,null,null,null,null,null,null,null,null,null,null,null,null,null,null,null,null,null,null,null,null,null,"園児","学童"]
[null,null,"B6",null,"B6",null,null,null,null,null,null,null,null,null,null,null,null,null,null,null,null,null,null,null,null,null,null,null,null,null,null,null,null,{"$f":"IF(wkPlan10=1,人数入力画面!R26+人数入力画面!W26,\"\")","v":""},{"$f":"IF(wkPlan10=1,人数入力画面!AB26,\"\")","v":""}]
[null,null,"B7",null,"B7"]
[null,null,"B8",null,"B8"]
[null,null,"B9",null,"B9"]
[null,null,"C1"]
[null,null,"C2"]
[null,null,"C3"]
[null,null,"C4"]
[null,null,"C5"]
[null,null,"C6"]
[null,null,"C7"]
[null,null,"C8"]
[null,null,"C9"]

{"sheet":"保険料計算用","index":12,"n_rows":28,"n_cols":62,"rows_kept":28,"cut":false,"hidden":true,"merged":[[0,48,0,49],[0,50,0,55],[0,56,0,61],[0,32,0,33],[0,34,0,35],[0,36,0,37],[0,39,0,40],[0,41,0,43],[0,44,0,46],[0,29,0,30],[0,16,0,17],[0,18,0,20],[0,21,0,23],[0,25,0,26],[0,27,0,28]]}
["プラン１","保険料①","保険料②",null,"プラン２","保険料①","保険料②",null,"プラン４","保険料①","保険料②",null,"プラン５","保険料①","保険料②",null,"オプション",null,"保険料①",null,null,"保険料②",null,null,null,"プラン６",null,"保険料①",null,"保険料②",null,null,"プラン８",null,"保険料①",null,"保険料②",null,null,"プラン９",null,"保険料①",null,null,"保険料②",null,null,null,"プラン１０",null,"保険料①",null,null,null,null,null,"保険料②"]
["A1",{"$f":"管理者設定画面１!E7","v":7370},{"$f":"管理者設定画面１!AS7","v":7370},null,"A1",{"$f":"管理者設定画面１!Y7","v":83},{"$f":"管理者設定画面１!BM7","v":83},null,"A",{"$f":"管理者設定画面１!E21","v":700},{"$f":"管理者設定画面１!AS21","v":700},null,"ER+",{"$f":"管理者設定画面１!W19","v":450},null,null,"園児数FROM","園児数TO","Q","R","S","Q","R","S",null,"園児数FROM","園児数TO","I","J","I","J",null,"総収入FROM","総収入TO","T","U","T","U",null,"総収入FROM","総収入TO","N","O","P","N","O","P",null,"園児数FROM","園児数TO","M","K","L","ME","KE","LE","M","K","L","ME","KE","LE"]
["A2",{"$f":"管理者設定画面１!E8","v":4620},{"$f":"管理者設定画面１!AS8","v":4620},null,"A2",{"$f":"管理者設定画面１!Y8","v":52},{"$f":"管理者設定画面１!BM8","v":52},null,"B",{"$f":"管理者設定画面１!E22","v":1720},{"$f":"管理者設定画面１!AS22","v":1720},null,"ER",{"$f":"管理者設定画面１!AA19","v":390},{"$f":"管理者設定画面１!BK19","v":330},null,0,50,{"$f":"管理者設定画面１!AE27","v":19250},{"$f":"管理者設定画面１!AH27","v":42000},{"$f":"管理者設定画面１!AK27","v":63000},{"$f":"管理者設定画面１!BS27","v":19250},{"$f":"管理者設定画面１!BV27","v":42000},{"$f":"管理者設定画面１!BY27","v":63000},null,0,100,{"$f":"管理者設定画面１!M26","v":20000},{"$f":"管理者設定画面１!Q26","v":32000},{"$f":"管理者設定画面１!BA26","v":20000},{"$f":"管理者設定画面１!BE26","v":32000},null,0,3,{"$f":"管理者設定画面１!L35","v":17040},{"$f":"管理者設定画面１!O35","v":24000},{"$f":"管理者設定画面１!AZ35","v":17040},{"$f":"管理者設定画面１!BC35","v":24000},null,0,3,{"$f":"管理者設定画面１!L46","v":52000},{"$f":"管理者設定画面１!O46","v":73000},{"$f":"管理者設定画面１!R46","v":105000},{"$f":"管理者設定画面１!AZ46","v":52000},{"$f":"管理者設定画面１!BC46","v":73000},{"$f":"管理者設定画面１!BF46","v":105000},null,0,50,{"$f":"管理者設定画面１!O55","v":9900},{"$f":"管理者設定画面１!S55","v":16000},{"$f":"管理者設定画面１!W55","v":21200},{"$f":"管理者設定画面１!AA55","v":38100},{"$f":"管理者設定画面１!AE55","v":63800},{"$f":"管理者設定画面１!AI55","v":113600},{"$f":"管理者設定画面１!BC55","v":9900},{"$f":"管理者設定画面１!BG55","v":16000},{"$f":"管理者設定画面１!BK55","v":21200},{"$f":"管理者設定画面１!BO55","v":38100},{"$f":"管理者設定画面１!BS55","v":63800},{"$f":"管理者設定画面１!BW55","v":113600}]
["A3",{"$f":"管理者設定画面１!E9","v":3700},{"$f":"管理者設定画面１!AS9","v":3700},null,"A3",{"$f":"管理者設定画面１!Y9","v":41},{"$f":"管理者設定画面１!BM9","v":41},null,"C",{"$f":"管理者設定画面１!K21","v":1550},{"$f":"管理者設定画面１!AY21","v":1550},null,"FR",{"$f":"管理者設定画面１!AA21","v":350},{"$f":"管理者設定画面１!BK21","v":290},null,51,100,{"$f":"管理者設定画面１!AE28","v":35000},{"$f":"管理者設定画面１!AH28","v":75600},{"$f":"管理者設定画面１!AK28","v":113400},{"$f":"管理者設定画面１!BS28","v":35000},{"$f":"管理者設定画面１!BV28","v":75600},{"$f":"管理者設定画面１!BY28","v":113400},null,101,200,{"$f":"管理者設定画面１!M27","v":25000},{"$f":"管理者設定画面１!Q27","v":45000},{"$f":"管理者設定画面１!BA27","v":25000},{"$f":"管理者設定画面１!BE27","v":45000},null,3.0000000099999999,10,{"$f":"管理者設定画面１!L37","v":52440},{"$f":"管理者設定画面１!O37","v":73920},{"$f":"管理者設定画面１!AZ37","v":52440},{"$f":"管理者設定画面１!BC37","v":73920},null,3.0000000099999999,10,{"$f":"管理者設定画面１!L48","v":56000},{"$f":"管理者設定画面１!O48","v":76000},{"$f":"管理者設定画面１!R48","v":111000},{"$f":"管理者設定画面１!AZ48","v":56000},{"$f":"管理者設定画面１!BC48","v":76000},{"$f":"管理者設定画面１!BF48","v":111000},null,51,100,{"$f":"管理者設定画面１!O56","v":9900},{"$f":"管理者設定画面１!S56","v":22300},{"$f":"管理者設定画面１!W56","v":29800},{"$f":"管理者設定画面１!AA56","v":44600},{"$f":"管理者設定画面１!AE56","v":82100},{"$f":"管理者設定画面１!AI56","v":142700},{"$f":"管理者設定画面１!BC56","v":9900},{"$f":"管理者設定画面１!BG56","v":22300},{"$f":"管理者設定画面１!BK56","v":29800},{"$f":"管理者設定画面１!BO56","v":44600},{"$f":"管理者設定画面１!BS56","v":82100},{"$f":"管理者設定画面１!BW56","v":142700}]
["A4",{"$f":"管理者設定画面１!E10","v":2780},{"$f":"管理者設定画面１!AS10","v":2780},null,"A4",{"$f":"管理者設定画面１!Y10","v":31},{"$f":"管理者設定画面１!BM10","v":31},null,"D",{"$f":"管理者設定画面１!K22","v":2500},{"$f":"管理者設定画面１!AY22","v":2500},null,"E",{"$f":"管理者設定画面１!AE19","v":340},{"$f":"管理者設定画面１!BO19","v":280},null,101,150,{"$f":"管理者設定画面１!AE29","v":49880},{"$f":"管理者設定画面１!AH29","v":113400},{"$f":"管理者設定画面１!AK29","v":160650},{"$f":"管理者設定画面１!BS29","v":49880},{"$f":"管理者設定画面１!BV29","v":113400},{"$f":"管理者設定画面１!BY29","v":160650},null,201,"-",{"$f":"管理者設定画面１!M28","v":30000},{"$f":"管理者設定画面１!Q28","v":54000},{"$f":"管理者設定画面１!BA28","v":30000},{"$f":"管理者設定画面１!BE28","v":54000},null,10.000000010000001,30,{"$f":"管理者設定画面１!L39","v":126060},{"$f":"管理者設定画面１!O39","v":177780},{"$f":"管理者設定画面１!AZ39","v":126060},{"$f":"管理者設定画面１!BC39","v":177780},null,10.000000010000001,50,{"$f":"管理者設定画面１!L50","v":66000},{"$f":"管理者設定画面１!O50","v":92000},{"$f":"管理者設定画面１!R50","v":133000},{"$f":"管理者設定画面１!AZ50","v":66000},{"$f":"管理者設定画面１!BC50","v":92000},{"$f":"管理者設定画面１!BF50","v":133000},null,101,"-",{"$f":"管理者設定画面１!O57","v":12500},{"$f":"管理者設定画面１!S57","v":28600},{"$f":"管理者設定画面１!W57","v":38400},{"$f":"管理者設定画面１!AA57","v":53000},{"$f":"管理者設定画面１!AE57","v":99300},{"$f":"管理者設定画面１!AI57","v":175100},{"$f":"管理者設定画面１!BC57","v":12500},{"$f":"管理者設定画面１!BG57","v":28600},{"$f":"管理者設定画面１!BK57","v":38400},{"$f":"管理者設定画面１!BO57","v":53000},{"$f":"管理者設定画面１!BS57","v":99300},{"$f":"管理者設定画面１!BW57","v":175100}]
["A5",{"$f":"管理者設定画面１!E11","v":2320},{"$f":"管理者設定画面１!AS11","v":2320},null,"A5",{"$f":"管理者設定画面１!Y11","v":27},{"$f":"管理者設定画面１!BM11","v":27},null,null,null,null,null,"F",{"$f":"管理者設定画面１!AE21","v":290},{"$f":"管理者設定画面１!BO21","v":240},null,151,200,{"$f":"管理者設定画面１!AE30","v":66500},{"$f":"管理者設定画面１!AH30","v":142800},{"$f":"管理者設定画面１!AK30","v":201600},{"$f":"管理者設定画面１!BS30","v":66500},{"$f":"管理者設定画面１!BV30","v":142800},{"$f":"管理者設定画面１!BY30","v":201600},null,null,null,null,null,null,null,null,30.000000010000001,50,{"$f":"管理者設定画面１!L41","v":179950},{"$f":"管理者設定画面１!O41","v":253880},{"$f":"管理者設定画面１!AZ41","v":179950},{"$f":"管理者設定画面１!BC41","v":253880}]
["A6",{"$f":"管理者設定画面１!E12","v":1860},{"$f":"管理者設定画面１!AS12","v":1860},null,"A6",{"$f":"管理者設定画面１!Y12","v":21},{"$f":"管理者設定画面１!BM12","v":21},null,null,null,null,null,"GR",{"$f":"管理者設定画面１!AI19","v":370},{"$f":"管理者設定画面１!BS19","v":320},null,201,250,{"$f":"管理者設定画面１!AE31","v":78750},{"$f":"管理者設定画面１!AH31","v":168000},{"$f":"管理者設定画面１!AK31","v":236250},{"$f":"管理者設定画面１!BS31","v":78750},{"$f":"管理者設定画面１!BV31","v":168000},{"$f":"管理者設定画面１!BY31","v":236250},null,"vlook列番号取得用",null,null,"選択している保険料テーブル＋型",null,null,null,null,null,null,null,null,null,null,"vlook列番号取得用",null,null,"選択している保険料テーブル＋型",null,null,null,null,null,"vlook列番号取得用",null,null,"選択している保険料テーブル＋型"]
["A7",{"$f":"管理者設定画面１!E13","v":1400},{"$f":"管理者設定画面１!AS13","v":1400},null,"A7",{"$f":"管理者設定画面１!Y13","v":16},{"$f":"管理者設定画面１!BM13","v":16},null,null,null,null,null,"HR",{"$f":"管理者設定画面１!AI21","v":310},{"$f":"管理者設定画面１!BS21","v":270},null,251,300,{"$f":"管理者設定画面１!AE32","v":89250},{"$f":"管理者設定画面１!AH32","v":189000},{"$f":"管理者設定画面１!AK32","v":264600},{"$f":"管理者設定画面１!BS32","v":89250},{"$f":"管理者設定画面１!BV32","v":189000},{"$f":"管理者設定画面１!BY32","v":264600},null,"①I",3,null,{"$f":"wkTblNo&WK!X8","v":"①"},null,null,null,"vlook列番号取得用",null,null,"選択している保険料テーブル＋型",null,null,null,"①N",3,null,{"$f":"wkTblNo&WK!X11","v":"①"},null,null,null,null,null,"①M",3,null,{"$f":"wkTblNo&WK!X12","v":"①"}]
["A8",{"$f":"管理者設定画面１!E14","v":1130},{"$f":"管理者設定画面１!AS14","v":1130},null,"A8",{"$f":"管理者設定画面１!Y14","v":13},{"$f":"管理者設定画面１!BM14","v":13},null,null,null,null,null,"G",{"$f":"管理者設定画面１!AM19","v":320},{"$f":"管理者設定画面１!BW19","v":270},null,301,350,{"$f":"管理者設定画面１!AE33","v":94500},{"$f":"管理者設定画面１!AH33","v":199500},{"$f":"管理者設定画面１!AK33","v":276500},{"$f":"管理者設定画面１!BS33","v":94500},{"$f":"管理者設定画面１!BV33","v":199500},{"$f":"管理者設定画面１!BY33","v":276500},null,"①J",4,null,null,null,null,null,"①T",3,null,{"$f":"wkTblNo&WK!X10","v":"①"},null,null,null,"①O",4,null,null,null,null,null,null,null,"①K",4]
["A9",{"$f":"管理者設定画面１!E15","v":960},{"$f":"管理者設定画面１!AS15","v":960},null,"A9",{"$f":"管理者設定画面１!Y15","v":11},{"$f":"管理者設定画面１!BM15","v":11},null,null,null,null,null,"H",{"$f":"管理者設定画面１!AM21","v":260},{"$f":"管理者設定画面１!BW21","v":220},null,351,400,{"$f":"管理者設定画面１!AE34","v":108000},{"$f":"管理者設定画面１!AH34","v":228000},{"$f":"管理者設定画面１!AK34","v":316000},{"$f":"管理者設定画面１!BS34","v":108000},{"$f":"管理者設定画面１!BV34","v":228000},{"$f":"管理者設定画面１!BY34","v":316000},null,"②I",5,null,"vlook列番号取得",null,null,null,"①U",4,null,null,null,null,null,"①P",5,null,"vlook列番号取得",null,null,null,null,null,"①L",5,null,"vlook列番号取得"]
["B1",{"$f":"管理者設定画面１!K7","v":6277},{"$f":"管理者設定画面１!AY7","v":6277},null,"B1",{"$f":"管理者設定画面１!AE7","v":75},{"$f":"管理者設定画面１!BS7","v":75},null,null,null,null,null,null,null,null,null,401,450,{"$f":"管理者設定画面１!AE35","v":121500},{"$f":"管理者設定画面１!AH35","v":256500},{"$f":"管理者設定画面１!AK35","v":355500},{"$f":"管理者設定画面１!BS35","v":121500},{"$f":"管理者設定画面１!BV35","v":256500},{"$f":"管理者設定画面１!BY35","v":355500},null,"②J",6,null,{"$f":"VLOOKUP(AC8,Z8:AA11,2,FALSE)","v":{"$error":"#N/A"}},null,null,null,"②T",5,null,"vlook列番号取得",null,null,null,"②N",6,null,{"$f":"VLOOKUP(AQ8,AN8:AO13,2,FALSE)","v":{"$error":"#N/A"}},null,null,null,null,null,"①ME",6,null,{"$f":"VLOOKUP(AZ8,AW8:AX19,2,FALSE)","v":{"$error":"#N/A"}}]
["B2",{"$f":"管理者設定画面１!K8","v":3923},{"$f":"管理者設定画面１!AY8","v":3923},null,"B2",{"$f":"管理者設定画面１!AE8","v":48},{"$f":"管理者設定画面１!BS8","v":48},null,null,null,null,null,null,null,null,null,451,500,{"$f":"管理者設定画面１!AE36","v":135000},{"$f":"管理者設定画面１!AH36","v":285000},{"$f":"管理者設定画面１!AK36","v":395000},{"$f":"管理者設定画面１!BS36","v":135000},{"$f":"管理者設定画面１!BV36","v":285000},{"$f":"管理者設定画面１!BY36","v":395000},null,null,null,null,null,null,null,null,"②U",6,null,{"$f":"VLOOKUP(AJ9,AG9:AH12,2,FALSE)","v":{"$error":"#N/A"}},null,null,null,"②O",7,null,null,null,null,null,null,null,"①KE",7]
["B3",{"$f":"管理者設定画面１!K9","v":3142},{"$f":"管理者設定画面１!AY9","v":3142},null,"B3",{"$f":"管理者設定画面１!AE9","v":38},{"$f":"管理者設定画面１!BS9","v":38},null,null,null,null,null,null,null,null,null,501,550,{"$f":"管理者設定画面１!AE37","v":148500},{"$f":"管理者設定画面１!AH37","v":313500},{"$f":"管理者設定画面１!AK37","v":434500},{"$f":"管理者設定画面１!BS37","v":148500},{"$f":"管理者設定画面１!BV37","v":313500},{"$f":"管理者設定画面１!BY37","v":434500},null,null,null,null,null,null,null,null,null,null,null,null,null,null,null,"②P",8,null,null,null,null,null,null,null,"①LE",8]
["B4",{"$f":"管理者設定画面１!K10","v":2364},{"$f":"管理者設定画面１!AY10","v":2364},null,"B4",{"$f":"管理者設定画面１!AE10","v":28},{"$f":"管理者設定画面１!BS10","v":28},null,null,null,null,null,null,null,null,null,551,"-",{"$f":"管理者設定画面１!AE38","v":162000},{"$f":"管理者設定画面１!AH38","v":342000},{"$f":"管理者設定画面１!AK38","v":474000},{"$f":"管理者設定画面１!BS38","v":162000},{"$f":"管理者設定画面１!BV38","v":342000},{"$f":"管理者設定画面１!BY38","v":474000},null,null,null,null,null,null,null,null,null,null,null,null,null,null,null,null,null,null,null,null,null,null,null,null,"②M",9]
["B5",{"$f":"管理者設定画面１!K11","v":1967},{"$f":"管理者設定画面１!AY11","v":1967},null,"B5",{"$f":"管理者設定画面１!AE11","v":23},{"$f":"管理者設定画面１!BS11","v":23},null,null,null,null,null,null,null,null,null,null,null,null,null,null,null,null,null,null,null,null,null,null,null,null,null,null,null,null,null,null,null,null,null,null,null,null,null,null,null,null,null,"②K",10]
["B6",{"$f":"管理者設定画面１!K12","v":1571},{"$f":"管理者設定画面１!AY12","v":1571},null,"B6",{"$f":"管理者設定画面１!AE12","v":20},{"$f":"管理者設定画面１!BS12","v":20},null,null,null,null,null,null,null,null,null,"vlook列番号取得用",null,null,"選択している保険料テーブル＋型",null,null,null,null,null,null,null,null,null,null,null,null,null,null,null,null,null,null,null,null,null,null,null,null,null,null,null,null,"②L",11]
["B7",{"$f":"管理者設定画面１!K13","v":1164},{"$f":"管理者設定画面１!AY13","v":1164},null,"B7",{"$f":"管理者設定画面１!AE13","v":15},{"$f":"管理者設定画面１!BS13","v":15},null,null,null,null,null,null,null,null,null,"①Q",3,null,{"$f":"wkTblNo&WK!X7","v":"①"},null,null,null,null,null,null,null,null,null,null,null,null,null,null,null,null,null,null,null,null,null,null,null,null,null,null,null,null,"②ME",12]
["B8",{"$f":"管理者設定画面１!K14","v":946},{"$f":"管理者設定画面１!AY14","v":946},null,"B8",{"$f":"管理者設定画面１!AE14","v":12},{"$f":"管理者設定画面１!BS14","v":12},null,null,null,null,null,null,null,null,null,"①R",4,null,null,null,null,null,null,null,null,null,null,null,null,null,null,null,null,null,null,null,null,null,null,null,null,null,null,null,null,null,null,"②KE",13]
["B9",{"$f":"管理者設定画面１!K15","v":801},{"$f":"管理者設定画面１!AY15","v":801},null,"B9",{"$f":"管理者設定画面１!AE15","v":9},{"$f":"管理者設定画面１!BS15","v":9},null,null,null,null,null,null,null,null,null,"①S",5,null,"vlook列番号取得",null,null,null,null,null,null,null,null,null,null,null,null,null,null,null,null,null,null,null,null,null,null,null,null,null,null,null,null,"②LE",14]
["C1",{"$f":"管理者設定画面１!Q7","v":7267},{"$f":"管理者設定画面１!BE7","v":7267},null,null,null,null,null,null,null,null,null,null,null,null,null,"②Q",6,null,{"$f":"VLOOKUP(T17,Q17:R22,2,FALSE)","v":{"$error":"#N/A"}}]
["C2",{"$f":"管理者設定画面１!Q8","v":4556},{"$f":"管理者設定画面１!BE8","v":4556},null,null,null,null,null,null,null,null,null,null,null,null,null,"②R",7]
["C3",{"$f":"管理者設定画面１!Q9","v":3648},{"$f":"管理者設定画面１!BE9","v":3648},null,null,null,null,null,null,null,null,null,null,null,null,null,"②S",8]
["C4",{"$f":"管理者設定画面１!Q10","v":2741},{"$f":"管理者設定画面１!BE10","v":2741}]
["C5",{"$f":"管理者設定画面１!Q11","v":2288},{"$f":"管理者設定画面１!BE11","v":2288}]
["C6",{"$f":"管理者設定画面１!Q12","v":1834},{"$f":"管理者設定画面１!BE12","v":1834}]
["C7",{"$f":"管理者設定画面１!Q13","v":1382},{"$f":"管理者設定画面１!BE13","v":1382}]
["C8",{"$f":"管理者設定画面１!Q14","v":1116},{"$f":"管理者設定画面１!BE14","v":1116}]
["C9",{"$f":"管理者設定画面１!Q15","v":946},{"$f":"管理者設定画面１!BE15","v":946}]

{"sheet":"ヒント","index":13,"n_rows":7,"n_cols":2,"rows_kept":7,"cut":false,"hidden":true,"merged":[]}
["ヒント表示用"]
["実績計算書","園児全員の加入が前提です。学童保育や職員を補償の対象に含めることができます。その場合は平均在籍者数の算出が必要です。新設保育園等の場合は、定員数などに基づき平均在籍園児数を算出ください。"]
["各行事の延参加者数","延参加者数は（前年の延参加者数実績－園児・職員の延参加者数）で算出します。新設保育園等の場合は見込み延参加者数により計算します。"]
["法定乗車定員数\nの合計","複数台のバス、自動車がある場合には、それぞれの法定乗車員数を合算します。"]
["直近会計年度の\n平均被用者数","平均被用者数は、ご加入時に把握可能な直近会計年度の政府労災資料（『労働保険概要・増加概算・確定保険料申告書』）をご確認ください。正当な理由なく平均被用者数を過少に申告された場合は保険金が削減される恐れがあります。"]
["加入月の前々月末時点\n職員人数の合計","-"]
["法人全体(日本国内)の直近会計年度の全事業収入の合計金額","総収入金額は法人全体（日本国内）の直近会計年度の全事業収入の合計金額を使用してください。\nなお、社会福祉法人の場合は、事業活動計算書　第２号の１様式「サービス活動収益計(1)」の金額を使用してください。"]